{"text_format":"1","workbook":"xlsx","n_sheets":6,"sheets":["Instructions","Graduate Preferences","Division Preferences","Final Matching","Process","Work"],"not_rendered":{"charts":0,"images":0,"macros":1,"external_links":0,"defined_names":2,"comments":0,"pivot_tables":0},"unopened":[],"bounds":{"document_bytes":16777216,"sheet_cells":100000,"rows_first":2000,"rows_last":500,"rows_between":2000,"halvings":0,"cell_chars":16384,"cell_head_chars":4096},"cells_cut":0,"cells_raw":0,"read":"whole","date_system":"1900"}

{"sheet":"Instructions","index":0,"n_rows":36,"n_cols":6,"rows_kept":36,"cut":false,"hidden":false,"merged":[[35,0,36,0],[9,2,9,5],[16,0,18,0],[18,2,18,5],[21,0,24,0],[1,0,2,0],[5,0,6,0],[9,0,13,0],[27,0,28,0],[31,0,32,0]]}
["Step 1"]
["At the top of the 'Graduate Preferences' Whorksheet, indicate the number of graduates and divisions. A matrix will appear."]
[]
[]
["Step 2"]
["In the first column, indicate the Graduates' names, one per row. In the first row, indicate the Divisions' names, one per column."]
[]
[]
["Step 3"]
["In each cell of the matrix, indicate the Graduate's preference for the corresponding Division. If the Graduate has not indicated a preference for this division, leave the cell blank. In the example, Graduate 1 has indicated Division 2 as his/her first preference, Division 3 as his second preference and has not listed Division 1. Graduate 2 has listed, in order, Divisions 3, 1 and 2.",null,"Graduate Preferences"]
[null,null,"Graduates/Divisions","D1","D2","D3"]
[null,null,"G1",null,1,2]
[null,null,"G2",2,3,1]
[]
[]
["Step 4"]
["In the 'Division Preferences' Worksheet, indicate the capacity of each Division in the second row. This is the maximum number of graduates the division can accommodate. In the example, Division 1 can accommodate two students while Divisions 2 and 3 can accomodate 1 student."]
[]
[null,null,"Division Preferences"]
[null,null,"Graduates/Divisions","D1","D2","D3"]
["Step 5",null,"Capacities",2,1,1]
["In each cell of the matrix, indicate the preference of the division's manager for the corresponding student. If the division is not interested in working with this graduate, leave the cell blank. In the example, Division 1 preferes Graduate 1 to Graduate 2 while Division 2 has the opposite preference. Division 3 would like to work with Graduate 2 but not with Graduate 1.",null,"G1",1,2]
[null,null,"G2",2,1,1]
[]
[]
[]
["Step 6"]
["In the 'Final Matching' Worksheet, Click on 'Match' to matching resulting of the 'Deferred Acceptance Algorithm'. This might take up to a minute."]
[]
[]
["Note 1"]
["The 'Process' Worksheet displays each step of the algorithm while the 'Work' Worksheet only contains some of the program's calculation and is of no interest to the user."]
[]
[]
["Note 2"]
["Should you wish to change some of the preferences and capacities, please ensure to press the 'Clean' button before running the algorithm again."]

{"sheet":"Graduate Preferences","index":1,"n_rows":30,"n_cols":8,"rows_kept":30,"cut":false,"hidden":false,"merged":[[0,2,0,3]]}
["Number of Graduates",26,"Number of Divisions",null,7]
[]
[]
["Graduates / Divisions","Finance","Marketing","Law","Jedi","Economics","Budget","Research"]
["Alvin",1,3,2,5,null,4,6]
["Bob",4,3,2,1]
["Chelsea",2,3,null,1,null,5,4]
["Daniel",4,3,5,2,1,null,6]
["Emily",null,3,null,1,2,null,4]
["Frank",5,1,6,2,4,7,3]
["Geraldine",null,2,null,4,5,3,1]
["Haley",5,4,1,6,3,null,2]
["Ian",1,2,null,4,3,5]
["Jeffrey",1,5,3,6,7,4,2]
["Kevin",5,6,null,4,1,2,3]
["Leia",2,5,6,4,3,7,1]
["Macey",null,4,6,3,2,1,5]
["Natalie",2,null,3,4,5,1]
["Oliver",null,5,4,null,2,1,3]
["Phoebe",6,1,4,3,null,5,2]
["Quentin",null,1,2,null,null,3]
["Rachael",2,3,5,1,6,null,4]
["Stuart",2,1,5,4,null,6,3]
["Theodore",3,1,null,4,2]
["Ursula",4,1,null,5,2,3,6]
["Victor",null,2,3,null,4,5,1]
["Wendy",6,3,5,null,1,2,4]
["Xavier",3,4,1,null,2,5,6]
["Yasmin",2,6,4,1,5,7,3]
["Zelda",null,null,null,3,4,2,1]

{"sheet":"Division Preferences","index":2,"n_rows":275,"n_cols":661,"rows_kept":275,"cut":false,"hidden":false,"merged":[[0,2,0,3]]}
[{"$f":"IF('Graduate Preferences'!A1=0,\"\",'Graduate Preferences'!A1)","v":"Number of Graduates"},{"$f":"IF('Graduate Preferences'!B1=0,\"\",'Graduate Preferences'!B1)","v":26},{"$f":"IF('Graduate Preferences'!C1=0,\"\",'Graduate Preferences'!C1)","v":"Number of Divisions"},null,{"$f":"IF('Graduate Preferences'!E1=0,\"\",'Graduate Preferences'!E1)","v":7},{"$f":"IF('Graduate Preferences'!F1=0,\"\",'Graduate Preferences'!F1)","v":""},{"$f":"IF('Graduate Preferences'!G1=0,\"\",'Graduate Preferences'!G1)","v":""},{"$f":"IF('Graduate Preferences'!H1=0,\"\",'Graduate Preferences'!H1)","v":""},{"$f":"IF('Graduate Preferences'!I1=0,\"\",'Graduate Preferences'!I1)","v":""},{"$f":"IF('Graduate Preferences'!J1=0,\"\",'Graduate Preferences'!J1)","v":""},{"$f":"IF('Graduate Preferences'!K1=0,\"\",'Graduate Preferences'!K1)","v":""},{"$f":"IF('Graduate Preferences'!L1=0,\"\",'Graduate Preferences'!L1)","v":""},{"$f":"IF('Graduate Preferences'!M1=0,\"\",'Graduate Preferences'!M1)","v":""}]
[{"$f":"IF('Graduate Preferences'!A2=0,\"\",'Graduate Preferences'!A2)","v":""}]
[{"$f":"IF('Graduate Preferences'!A3=0,\"\",'Graduate Preferences'!A3)","v":""}]
[{"$f":"IF('Graduate Preferences'!A4=0,\"\",'Graduate Preferences'!A4)","v":"Graduates / Divisions"},{"$f":"IF('Graduate Preferences'!B4=0,\"\",'Graduate Preferences'!B4)","v":"Finance"},{"$f":"IF('Graduate Preferences'!C4=0,\"\",'Graduate Preferences'!C4)","v":"Marketing"},{"$f":"IF('Graduate Preferences'!D4=0,\"\",'Graduate Preferences'!D4)","v":"Law"},{"$f":"IF('Graduate Preferences'!E4=0,\"\",'Graduate Preferences'!E4)","v":"Jedi"},{"$f":"IF('Graduate Preferences'!F4=0,\"\",'Graduate Preferences'!F4)","v":"Economics"},{"$f":"IF('Graduate Preferences'!G4=0,\"\",'Graduate Preferences'!G4)","v":"Budget"},{"$f":"IF('Graduate Preferences'!H4=0,\"\",'Graduate Preferences'!H4)","v":"Research"},{"$f":"IF('Graduate Preferences'!I4=0,\"\",'Graduate Preferences'!I4)","v":""},{"$f":"IF('Graduate Preferences'!J4=0,\"\",'Graduate Preferences'!J4)","v":""},{"$f":"IF('Graduate Preferences'!K4=0,\"\",'Graduate Preferences'!K4)","v":""},{"$f":"IF('Graduate Preferences'!L4=0,\"\",'Graduate Preferences'!L4)","v":""},{"$f":"IF('Graduate Preferences'!M4=0,\"\",'Graduate Preferences'!M4)","v":""},{"$f":"IF('Graduate Preferences'!N4=0,\"\",'Graduate Preferences'!N4)","v":""},{"$f":"IF('Graduate Preferences'!O4=0,\"\",'Graduate Preferences'!O4)","v":""},{"$f":"IF('Graduate Preferences'!P4=0,\"\",'Graduate Preferences'!P4)","v":""},{"$f":"IF('Graduate Preferences'!Q4=0,\"\",'Graduate Preferences'!Q4)","v":""},{"$f":"IF('Graduate Preferences'!R4=0,\"\",'Graduate Preferences'!R4)","v":""},{"$f":"IF('Graduate Preferences'!S4=0,\"\",'Graduate Preferences'!S4)","v":""},{"$f":"IF('Graduate Preferences'!T4=0,\"\",'Graduate Preferences'!T4)","v":""},{"$f":"IF('Graduate Preferences'!U4=0,\"\",'Graduate Preferences'!U4)","v":""},{"$f":"IF('Graduate Preferences'!V4=0,\"\",'Graduate Preferences'!V4)","v":""},{"$f":"IF('Graduate Preferences'!W4=0,\"\",'Graduate Preferences'!W4)","v":""},{"$f":"IF('Graduate Preferences'!X4=0,\"\",'Graduate Preferences'!X4)","v":""},{"$f":"IF('Graduate Preferences'!Y4=0,\"\",'Graduate Preferences'!Y4)","v":""},{"$f":"IF('Graduate Preferences'!Z4=0,\"\",'Graduate Preferences'!Z4)","v":""},{"$f":"IF('Graduate Preferences'!AA4=0,\"\",'Graduate Preferences'!AA4)","v":""},{"$f":"IF('Graduate Preferences'!AB4=0,\"\",'Graduate Preferences'!AB4)","v":""},{"$f":"IF('Graduate Preferences'!AC4=0,\"\",'Graduate Preferences'!AC4)","v":""},{"$f":"IF('Graduate Preferences'!AD4=0,\"\",'Graduate Preferences'!AD4)","v":""},{"$f":"IF('Graduate Preferences'!AE4=0,\"\",'Graduate Preferences'!AE4)","v":""},{"$f":"IF('Graduate Preferences'!AF4=0,\"\",'Graduate Preferences'!AF4)","v":""},{"$f":"IF('Graduate Preferences'!AG4=0,\"\",'Graduate Preferences'!AG4)","v":""},{"$f":"IF('Graduate Preferences'!AH4=0,\"\",'Graduate Preferences'!AH4)","v":""},{"$f":"IF('Graduate Preferences'!AI4=0,\"\",'Graduate Preferences'!AI4)","v":""},{"$f":"IF('Graduate Preferences'!AJ4=0,\"\",'Graduate Preferences'!AJ4)","v":""},{"$f":"IF('Graduate Preferences'!AK4=0,\"\",'Graduate Preferences'!AK4)","v":""},{"$f":"IF('Graduate Preferences'!AL4=0,\"\",'Graduate Preferences'!AL4)","v":""},{"$f":"IF('Graduate Preferences'!AM4=0,\"\",'Graduate Preferences'!AM4)","v":""},{"$f":"IF('Graduate Preferences'!AN4=0,\"\",'Graduate Preferences'!AN4)","v":""},{"$f":"IF('Graduate Preferences'!AO4=0,\"\",'Graduate Preferences'!AO4)","v":""},{"$f":"IF('Graduate Preferences'!AP4=0,\"\",'Graduate Preferences'!AP4)","v":""},{"$f":"IF('Graduate Preferences'!AQ4=0,\"\",'Graduate Preferences'!AQ4)","v":""},{"$f":"IF('Graduate Preferences'!AR4=0,\"\",'Graduate Preferences'!AR4)","v":""},{"$f":"IF('Graduate Preferences'!AS4=0,\"\",'Graduate Preferences'!AS4)","v":""},{"$f":"IF('Graduate Preferences'!AT4=0,\"\",'Graduate Preferences'!AT4)","v":""},{"$f":"IF('Graduate Preferences'!AU4=0,\"\",'Graduate Preferences'!AU4)","v":""},{"$f":"IF('Graduate Preferences'!AV4=0,\"\",'Graduate Preferences'!AV4)","v":""},{"$f":"IF('Graduate Preferences'!AW4=0,\"\",'Graduate Preferences'!AW4)","v":""},{"$f":"IF('Graduate Preferences'!AX4=0,\"\",'Graduate Preferences'!AX4)","v":""},{"$f":"IF('Graduate Preferences'!AY4=0,\"\",'Graduate Preferences'!AY4)","v":""},{"$f":"IF('Graduate Preferences'!AZ4=0,\"\",'Graduate Preferences'!AZ4)","v":""},{"$f":"IF('Graduate Preferences'!BA4=0,\"\",'Graduate Preferences'!BA4)","v":""},{"$f":"IF('Graduate Preferences'!BB4=0,\"\",'Graduate Preferences'!BB4)","v":""},{"$f":"IF('Graduate Preferences'!BC4=0,\"\",'Graduate Preferences'!BC4)","v":""},{"$f":"IF('Graduate Preferences'!BD4=0,\"\",'Graduate Preferences'!BD4)","v":""},{"$f":"IF('Graduate Preferences'!BE4=0,\"\",'Graduate Preferences'!BE4)","v":""},{"$f":"IF('Graduate Preferences'!BF4=0,\"\",'Graduate Preferences'!BF4)","v":""},{"$f":"IF('Graduate Preferences'!BG4=0,\"\",'Graduate Preferences'!BG4)","v":""},{"$f":"IF('Graduate Preferences'!BH4=0,\"\",'Graduate Preferences'!BH4)","v":""},{"$f":"IF('Graduate Preferences'!BI4=0,\"\",'Graduate Preferences'!BI4)","v":""},{"$f":"IF('Graduate Preferences'!BJ4=0,\"\",'Graduate Preferences'!BJ4)","v":""},{"$f":"IF('Graduate Preferences'!BK4=0,\"\",'Graduate Preferences'!BK4)","v":""},{"$f":"IF('Graduate Preferences'!BL4=0,\"\",'Graduate Preferences'!BL4)","v":""},{"$f":"IF('Graduate Preferences'!BM4=0,\"\",'Graduate Preferences'!BM4)","v":""},{"$f":"IF('Graduate Preferences'!BN4=0,\"\",'Graduate Preferences'!BN4)","v":""},{"$f":"IF('Graduate Preferences'!BO4=0,\"\",'Graduate Preferences'!BO4)","v":""},{"$f":"IF('Graduate Preferences'!BP4=0,\"\",'Graduate Preferences'!BP4)","v":""},{"$f":"IF('Graduate Preferences'!BQ4=0,\"\",'Graduate Preferences'!BQ4)","v":""},{"$f":"IF('Graduate Preferences'!BR4=0,\"\",'Graduate Preferences'!BR4)","v":""},{"$f":"IF('Graduate Preferences'!BS4=0,\"\",'Graduate Preferences'!BS4)","v":""},{"$f":"IF('Graduate Preferences'!BT4=0,\"\",'Graduate Preferences'!BT4)","v":""},{"$f":"IF('Graduate Preferences'!BU4=0,\"\",'Graduate Preferences'!BU4)","v":""},{"$f":"IF('Graduate Preferences'!BV4=0,\"\",'Graduate Preferences'!BV4)","v":""},{"$f":"IF('Graduate Preferences'!BW4=0,\"\",'Graduate Preferences'!BW4)","v":""},{"$f":"IF('Graduate Preferences'!BX4=0,\"\",'Graduate Preferences'!BX4)","v":""},{"$f":"IF('Graduate Preferences'!BY4=0,\"\",'Graduate Preferences'!BY4)","v":""},{"$f":"IF('Graduate Preferences'!BZ4=0,\"\",'Graduate Preferences'!BZ4)","v":""},{"$f":"IF('Graduate Preferences'!CA4=0,\"\",'Graduate Preferences'!CA4)","v":""},{"$f":"IF('Graduate Preferences'!CB4=0,\"\",'Graduate Preferences'!CB4)","v":""},{"$f":"IF('Graduate Preferences'!CC4=0,\"\",'Graduate Preferences'!CC4)","v":""},{"$f":"IF('Graduate Preferences'!CD4=0,\"\",'Graduate Preferences'!CD4)","v":""},{"$f":"IF('Graduate Preferences'!CE4=0,\"\",'Graduate Preferences'!CE4)","v":""},{"$f":"IF('Graduate Preferences'!CF4=0,\"\",'Graduate Preferences'!CF4)","v":""},{"$f":"IF('Graduate Preferences'!CG4=0,\"\",'Graduate Preferences'!CG4)","v":""},{"$f":"IF('Graduate Preferences'!CH4=0,\"\",'Graduate Preferences'!CH4)","v":""},{"$f":"IF('Graduate Preferences'!CI4=0,\"\",'Graduate Preferences'!CI4)","v":""},{"$f":"IF('Graduate Preferences'!CJ4=0,\"\",'Graduate Preferences'!CJ4)","v":""},{"$f":"IF('Graduate Preferences'!CK4=0,\"\",'Graduate Preferences'!CK4)","v":""},{"$f":"IF('Graduate Preferences'!CL4=0,\"\",'Graduate Preferences'!CL4)","v":""},{"$f":"IF('Graduate Preferences'!CM4=0,\"\",'Graduate Preferences'!CM4)","v":""},{"$f":"IF('Graduate Preferences'!CN4=0,\"\",'Graduate Preferences'!CN4)","v":""},{"$f":"IF('Graduate Preferences'!CO4=0,\"\",'Graduate Preferences'!CO4)","v":""},{"$f":"IF('Graduate Preferences'!CP4=0,\"\",'Graduate Preferences'!CP4)","v":""},{"$f":"IF('Graduate Preferences'!CQ4=0,\"\",'Graduate Preferences'!CQ4)","v":""},{"$f":"IF('Graduate Preferences'!CR4=0,\"\",'Graduate Preferences'!CR4)","v":""},{"$f":"IF('Graduate Preferences'!CS4=0,\"\",'Graduate Preferences'!CS4)","v":""},{"$f":"IF('Graduate Preferences'!CT4=0,\"\",'Graduate Preferences'!CT4)","v":""},{"$f":"IF('Graduate Preferences'!CU4=0,\"\",'Graduate Preferences'!CU4)","v":""},{"$f":"IF('Graduate Preferences'!CV4=0,\"\",'Graduate Preferences'!CV4)","v":""},{"$f":"IF('Graduate Preferences'!CW4=0,\"\",'Graduate Preferences'!CW4)","v":""},{"$f":"IF('Graduate Preferences'!CX4=0,\"\",'Graduate Preferences'!CX4)","v":""},{"$f":"IF('Graduate Preferences'!CY4=0,\"\",'Graduate Preferences'!CY4)","v":""},{"$f":"IF('Graduate Preferences'!CZ4=0,\"\",'Graduate Preferences'!CZ4)","v":""},{"$f":"IF('Graduate Preferences'!DA4=0,\"\",'Graduate Preferences'!DA4)","v":""},{"$f":"IF('Graduate Preferences'!DB4=0,\"\",'Graduate Preferences'!DB4)","v":""},{"$f":"IF('Graduate Preferences'!DC4=0,\"\",'Graduate Preferences'!DC4)","v":""},{"$f":"IF('Graduate Preferences'!DD4=0,\"\",'Graduate Preferences'!DD4)","v":""},{"$f":"IF('Graduate Preferences'!DE4=0,\"\",'Graduate Preferences'!DE4)","v":""},{"$f":"IF('Graduate Preferences'!DF4=0,\"\",'Graduate Preferences'!DF4)","v":""},{"$f":"IF('Graduate Preferences'!DG4=0,\"\",'Graduate Preferences'!DG4)","v":""},{"$f":"IF('Graduate Preferences'!DH4=0,\"\",'Graduate Preferences'!DH4)","v":""},{"$f":"IF('Graduate Preferences'!DI4=0,\"\",'Graduate Preferences'!DI4)","v":""},{"$f":"IF('Graduate Preferences'!DJ4=0,\"\",'Graduate Preferences'!DJ4)","v":""},{"$f":"IF('Graduate Preferences'!DK4=0,\"\",'Graduate Preferences'!DK4)","v":""},{"$f":"IF('Graduate Preferences'!DL4=0,\"\",'Graduate Preferences'!DL4)","v":""},{"$f":"IF('Graduate Preferences'!DM4=0,\"\",'Graduate Preferences'!DM4)","v":""},{"$f":"IF('Graduate Preferences'!DN4=0,\"\",'Graduate Preferences'!DN4)","v":""},{"$f":"IF('Graduate Preferences'!DO4=0,\"\",'Graduate Preferences'!DO4)","v":""},{"$f":"IF('Graduate Preferences'!DP4=0,\"\",'Graduate Preferences'!DP4)","v":""},{"$f":"IF('Graduate Preferences'!DQ4=0,\"\",'Graduate Preferences'!DQ4)","v":""},{"$f":"IF('Graduate Preferences'!DR4=0,\"\",'Graduate Preferences'!DR4)","v":""},{"$f":"IF('Graduate Preferences'!DS4=0,\"\",'Graduate Preferences'!DS4)","v":""},{"$f":"IF('Graduate Preferences'!DT4=0,\"\",'Graduate Preferences'!DT4)","v":""},{"$f":"IF('Graduate Preferences'!DU4=0,\"\",'Graduate Preferences'!DU4)","v":""},{"$f":"IF('Graduate Preferences'!DV4=0,\"\",'Graduate Preferences'!DV4)","v":""},{"$f":"IF('Graduate Preferences'!DW4=0,\"\",'Graduate Preferences'!DW4)","v":""},{"$f":"IF('Graduate Preferences'!DX4=0,\"\",'Graduate Preferences'!DX4)","v":""},{"$f":"IF('Graduate Preferences'!DY4=0,\"\",'Graduate Preferences'!DY4)","v":""},{"$f":"IF('Graduate Preferences'!DZ4=0,\"\",'Graduate Preferences'!DZ4)","v":""},{"$f":"IF('Graduate Preferences'!EA4=0,\"\",'Graduate Preferences'!EA4)","v":""},{"$f":"IF('Graduate Preferences'!EB4=0,\"\",'Graduate Preferences'!EB4)","v":""},{"$f":"IF('Graduate Preferences'!EC4=0,\"\",'Graduate Preferences'!EC4)","v":""},{"$f":"IF('Graduate Preferences'!ED4=0,\"\",'Graduate Preferences'!ED4)","v":""},{"$f":"IF('Graduate Preferences'!EE4=0,\"\",'Graduate Preferences'!EE4)","v":""},{"$f":"IF('Graduate Preferences'!EF4=0,\"\",'Graduate Preferences'!EF4)","v":""},{"$f":"IF('Graduate Preferences'!EG4=0,\"\",'Graduate Preferences'!EG4)","v":""},{"$f":"IF('Graduate Preferences'!EH4=0,\"\",'Graduate Preferences'!EH4)","v":""},{"$f":"IF('Graduate Preferences'!EI4=0,\"\",'Graduate Preferences'!EI4)","v":""},{"$f":"IF('Graduate Preferences'!EJ4=0,\"\",'Graduate Preferences'!EJ4)","v":""},{"$f":"IF('Graduate Preferences'!EK4=0,\"\",'Graduate Preferences'!EK4)","v":""},{"$f":"IF('Graduate Preferences'!EL4=0,\"\",'Graduate Preferences'!EL4)","v":""},{"$f":"IF('Graduate Preferences'!EM4=0,\"\",'Graduate Preferences'!EM4)","v":""},{"$f":"IF('Graduate Preferences'!EN4=0,\"\",'Graduate Preferences'!EN4)","v":""},{"$f":"IF('Graduate Preferences'!EO4=0,\"\",'Graduate Preferences'!EO4)","v":""},{"$f":"IF('Graduate Preferences'!EP4=0,\"\",'Graduate Preferences'!EP4)","v":""},{"$f":"IF('Graduate Preferences'!EQ4=0,\"\",'Graduate Preferences'!EQ4)","v":""},{"$f":"IF('Graduate Preferences'!ER4=0,\"\",'Graduate Preferences'!ER4)","v":""},{"$f":"IF('Graduate Preferences'!ES4=0,\"\",'Graduate Preferences'!ES4)","v":""},{"$f":"IF('Graduate Preferences'!ET4=0,\"\",'Graduate Preferences'!ET4)","v":""},{"$f":"IF('Graduate Preferences'!EU4=0,\"\",'Graduate Preferences'!EU4)","v":""},{"$f":"IF('Graduate Preferences'!EV4=0,\"\",'Graduate Preferences'!EV4)","v":""},{"$f":"IF('Graduate Preferences'!EW4=0,\"\",'Graduate Preferences'!EW4)","v":""},{"$f":"IF('Graduate Preferences'!EX4=0,\"\",'Graduate Preferences'!EX4)","v":""},{"$f":"IF('Graduate Preferences'!EY4=0,\"\",'Graduate Preferences'!EY4)","v":""},{"$f":"IF('Graduate Preferences'!EZ4=0,\"\",'Graduate Preferences'!EZ4)","v":""},{"$f":"IF('Graduate Preferences'!FA4=0,\"\",'Graduate Preferences'!FA4)","v":""},{"$f":"IF('Graduate Preferences'!FB4=0,\"\",'Graduate Preferences'!FB4)","v":""},{"$f":"IF('Graduate Preferences'!FC4=0,\"\",'Graduate Preferences'!FC4)","v":""},{"$f":"IF('Graduate Preferences'!FD4=0,\"\",'Graduate Preferences'!FD4)","v":""},{"$f":"IF('Graduate Preferences'!FE4=0,\"\",'Graduate Preferences'!FE4)","v":""},{"$f":"IF('Graduate Preferences'!FF4=0,\"\",'Graduate Preferences'!FF4)","v":""},{"$f":"IF('Graduate Preferences'!FG4=0,\"\",'Graduate Preferences'!FG4)","v":""},{"$f":"IF('Graduate Preferences'!FH4=0,\"\",'Graduate Preferences'!FH4)","v":""},{"$f":"IF('Graduate Preferences'!FI4=0,\"\",'Graduate Preferences'!FI4)","v":""},{"$f":"IF('Graduate Preferences'!FJ4=0,\"\",'Graduate Preferences'!FJ4)","v":""},{"$f":"IF('Graduate Preferences'!FK4=0,\"\",'Graduate Preferences'!FK4)","v":""},{"$f":"IF('Graduate Preferences'!FL4=0,\"\",'Graduate Preferences'!FL4)","v":""},{"$f":"IF('Graduate Preferences'!FM4=0,\"\",'Graduate Preferences'!FM4)","v":""},{"$f":"IF('Graduate Preferences'!FN4=0,\"\",'Graduate Preferences'!FN4)","v":""},{"$f":"IF('Graduate Preferences'!FO4=0,\"\",'Graduate Preferences'!FO4)","v":""},{"$f":"IF('Graduate Preferences'!FP4=0,\"\",'Graduate Preferences'!FP4)","v":""},{"$f":"IF('Graduate Preferences'!FQ4=0,\"\",'Graduate Preferences'!FQ4)","v":""},{"$f":"IF('Graduate Preferences'!FR4=0,\"\",'Graduate Preferences'!FR4)","v":""},{"$f":"IF('Graduate Preferences'!FS4=0,\"\",'Graduate Preferences'!FS4)","v":""},{"$f":"IF('Graduate Preferences'!FT4=0,\"\",'Graduate Preferences'!FT4)","v":""},{"$f":"IF('Graduate Preferences'!FU4=0,\"\",'Graduate Preferences'!FU4)","v":""},{"$f":"IF('Graduate Preferences'!FV4=0,\"\",'Graduate Preferences'!FV4)","v":""},{"$f":"IF('Graduate Preferences'!FW4=0,\"\",'Graduate Preferences'!FW4)","v":""},{"$f":"IF('Graduate Preferences'!FX4=0,\"\",'Graduate Preferences'!FX4)","v":""},{"$f":"IF('Graduate Preferences'!FY4=0,\"\",'Graduate Preferences'!FY4)","v":""},{"$f":"IF('Graduate Preferences'!FZ4=0,\"\",'Graduate Preferences'!FZ4)","v":""},{"$f":"IF('Graduate Preferences'!GA4=0,\"\",'Graduate Preferences'!GA4)","v":""},{"$f":"IF('Graduate Preferences'!GB4=0,\"\",'Graduate Preferences'!GB4)","v":""},{"$f":"IF('Graduate Preferences'!GC4=0,\"\",'Graduate Preferences'!GC4)","v":""},{"$f":"IF('Graduate Preferences'!GD4=0,\"\",'Graduate Preferences'!GD4)","v":""},{"$f":"IF('Graduate Preferences'!GE4=0,\"\",'Graduate Preferences'!GE4)","v":""},{"$f":"IF('Graduate Preferences'!GF4=0,\"\",'Graduate Preferences'!GF4)","v":""},{"$f":"IF('Graduate Preferences'!GG4=0,\"\",'Graduate Preferences'!GG4)","v":""},{"$f":"IF('Graduate Preferences'!GH4=0,\"\",'Graduate Preferences'!GH4)","v":""},{"$f":"IF('Graduate Preferences'!GI4=0,\"\",'Graduate Preferences'!GI4)","v":""},{"$f":"IF('Graduate Preferences'!GJ4=0,\"\",'Graduate Preferences'!GJ4)","v":""},{"$f":"IF('Graduate Preferences'!GK4=0,\"\",'Graduate Preferences'!GK4)","v":""},{"$f":"IF('Graduate Preferences'!GL4=0,\"\",'Graduate Preferences'!GL4)","v":""},{"$f":"IF('Graduate Preferences'!GM4=0,\"\",'Graduate Preferences'!GM4)","v":""},{"$f":"IF('Graduate Preferences'!GN4=0,\"\",'Graduate Preferences'!GN4)","v":""},{"$f":"IF('Graduate Preferences'!GO4=0,\"\",'Graduate Preferences'!GO4)","v":""},{"$f":"IF('Graduate Preferences'!GP4=0,\"\",'Graduate Preferences'!GP4)","v":""},{"$f":"IF('Graduate Preferences'!GQ4=0,\"\",'Graduate Preferences'!GQ4)","v":""},{"$f":"IF('Graduate Preferences'!GR4=0,\"\",'Graduate Preferences'!GR4)","v":""},{"$f":"IF('Graduate Preferences'!GS4=0,\"\",'Graduate Preferences'!GS4)","v":""},{"$f":"IF('Graduate Preferences'!GT4=0,\"\",'Graduate Preferences'!GT4)","v":""},{"$f":"IF('Graduate Preferences'!GU4=0,\"\",'Graduate Preferences'!GU4)","v":""},{"$f":"IF('Graduate Preferences'!GV4=0,\"\",'Graduate Preferences'!GV4)","v":""},{"$f":"IF('Graduate Preferences'!GW4=0,\"\",'Graduate Preferences'!GW4)","v":""},{"$f":"IF('Graduate Preferences'!GX4=0,\"\",'Graduate Preferences'!GX4)","v":""},{"$f":"IF('Graduate Preferences'!GY4=0,\"\",'Graduate Preferences'!GY4)","v":""},{"$f":"IF('Graduate Preferences'!GZ4=0,\"\",'Graduate Preferences'!GZ4)","v":""},{"$f":"IF('Graduate Preferences'!HA4=0,\"\",'Graduate Preferences'!HA4)","v":""},{"$f":"IF('Graduate Preferences'!HB4=0,\"\",'Graduate Preferences'!HB4)","v":""},{"$f":"IF('Graduate Preferences'!HC4=0,\"\",'Graduate Preferences'!HC4)","v":""},{"$f":"IF('Graduate Preferences'!HD4=0,\"\",'Graduate Preferences'!HD4)","v":""},{"$f":"IF('Graduate Preferences'!HE4=0,\"\",'Graduate Preferences'!HE4)","v":""},{"$f":"IF('Graduate Preferences'!HF4=0,\"\",'Graduate Preferences'!HF4)","v":""},{"$f":"IF('Graduate Preferences'!HG4=0,\"\",'Graduate Preferences'!HG4)","v":""},{"$f":"IF('Graduate Preferences'!HH4=0,\"\",'Graduate Preferences'!HH4)","v":""},{"$f":"IF('Graduate Preferences'!HI4=0,\"\",'Graduate Preferences'!HI4)","v":""},{"$f":"IF('Graduate Preferences'!HJ4=0,\"\",'Graduate Preferences'!HJ4)","v":""},{"$f":"IF('Graduate Preferences'!HK4=0,\"\",'Graduate Preferences'!HK4)","v":""},{"$f":"IF('Graduate Preferences'!HL4=0,\"\",'Graduate Preferences'!HL4)","v":""},{"$f":"IF('Graduate Preferences'!HM4=0,\"\",'Graduate Preferences'!HM4)","v":""},{"$f":"IF('Graduate Preferences'!HN4=0,\"\",'Graduate Preferences'!HN4)","v":""},{"$f":"IF('Graduate Preferences'!HO4=0,\"\",'Graduate Preferences'!HO4)","v":""},{"$f":"IF('Graduate Preferences'!HP4=0,\"\",'Graduate Preferences'!HP4)","v":""},{"$f":"IF('Graduate Preferences'!HQ4=0,\"\",'Graduate Preferences'!HQ4)","v":""},{"$f":"IF('Graduate Preferences'!HR4=0,\"\",'Graduate Preferences'!HR4)","v":""},{"$f":"IF('Graduate Preferences'!HS4=0,\"\",'Graduate Preferences'!HS4)","v":""},{"$f":"IF('Graduate Preferences'!HT4=0,\"\",'Graduate Preferences'!HT4)","v":""},{"$f":"IF('Graduate Preferences'!HU4=0,\"\",'Graduate Preferences'!HU4)","v":""},{"$f":"IF('Graduate Preferences'!HV4=0,\"\",'Graduate Preferences'!HV4)","v":""},{"$f":"IF('Graduate Preferences'!HW4=0,\"\",'Graduate Preferences'!HW4)","v":""},{"$f":"IF('Graduate Preferences'!HX4=0,\"\",'Graduate Preferences'!HX4)","v":""},{"$f":"IF('Graduate Preferences'!HY4=0,\"\",'Graduate Preferences'!HY4)","v":""},{"$f":"IF('Graduate Preferences'!HZ4=0,\"\",'Graduate Preferences'!HZ4)","v":""},{"$f":"IF('Graduate Preferences'!IA4=0,\"\",'Graduate Preferences'!IA4)","v":""},{"$f":"IF('Graduate Preferences'!IB4=0,\"\",'Graduate Preferences'!IB4)","v":""},{"$f":"IF('Graduate Preferences'!IC4=0,\"\",'Graduate Preferences'!IC4)","v":""},{"$f":"IF('Graduate Preferences'!ID4=0,\"\",'Graduate Preferences'!ID4)","v":""},{"$f":"IF('Graduate Preferences'!IE4=0,\"\",'Graduate Preferences'!IE4)","v":""},{"$f":"IF('Graduate Preferences'!IF4=0,\"\",'Graduate Preferences'!IF4)","v":""},{"$f":"IF('Graduate Preferences'!IG4=0,\"\",'Graduate Preferences'!IG4)","v":""},{"$f":"IF('Graduate Preferences'!IH4=0,\"\",'Graduate Preferences'!IH4)","v":""},{"$f":"IF('Graduate Preferences'!II4=0,\"\",'Graduate Preferences'!II4)","v":""},{"$f":"IF('Graduate Preferences'!IJ4=0,\"\",'Graduate Preferences'!IJ4)","v":""},{"$f":"IF('Graduate Preferences'!IK4=0,\"\",'Graduate Preferences'!IK4)","v":""},{"$f":"IF('Graduate Preferences'!IL4=0,\"\",'Graduate Preferences'!IL4)","v":""},{"$f":"IF('Graduate Preferences'!IM4=0,\"\",'Graduate Preferences'!IM4)","v":""},{"$f":"IF('Graduate Preferences'!IN4=0,\"\",'Graduate Preferences'!IN4)","v":""},{"$f":"IF('Graduate Preferences'!IO4=0,\"\",'Graduate Preferences'!IO4)","v":""},{"$f":"IF('Graduate Preferences'!IP4=0,\"\",'Graduate Preferences'!IP4)","v":""},{"$f":"IF('Graduate Preferences'!IQ4=0,\"\",'Graduate Preferences'!IQ4)","v":""},{"$f":"IF('Graduate Preferences'!IR4=0,\"\",'Graduate Preferences'!IR4)","v":""},{"$f":"IF('Graduate Preferences'!IS4=0,\"\",'Graduate Preferences'!IS4)","v":""},{"$f":"IF('Graduate Preferences'!IT4=0,\"\",'Graduate Preferences'!IT4)","v":""},{"$f":"IF('Graduate Preferences'!IU4=0,\"\",'Graduate Preferences'!IU4)","v":""},{"$f":"IF('Graduate Preferences'!IV4=0,\"\",'Graduate Preferences'!IV4)","v":""},{"$f":"IF('Graduate Preferences'!IW4=0,\"\",'Graduate Preferences'!IW4)","v":""},{"$f":"IF('Graduate Preferences'!IX4=0,\"\",'Graduate Preferences'!IX4)","v":""},{"$f":"IF('Graduate Preferences'!IY4=0,\"\",'Graduate Preferences'!IY4)","v":""},{"$f":"IF('Graduate Preferences'!IZ4=0,\"\",'Graduate Preferences'!IZ4)","v":""},{"$f":"IF('Graduate Preferences'!JA4=0,\"\",'Graduate Preferences'!JA4)","v":""},{"$f":"IF('Graduate Preferences'!JB4=0,\"\",'Graduate Preferences'!JB4)","v":""},{"$f":"IF('Graduate Preferences'!JC4=0,\"\",'Graduate Preferences'!JC4)","v":""},{"$f":"IF('Graduate Preferences'!JD4=0,\"\",'Graduate Preferences'!JD4)","v":""},{"$f":"IF('Graduate Preferences'!JE4=0,\"\",'Graduate Preferences'!JE4)","v":""},{"$f":"IF('Graduate Preferences'!JF4=0,\"\",'Graduate Preferences'!JF4)","v":""},{"$f":"IF('Graduate Preferences'!JG4=0,\"\",'Graduate Preferences'!JG4)","v":""},{"$f":"IF('Graduate Preferences'!JH4=0,\"\",'Graduate Preferences'!JH4)","v":""},{"$f":"IF('Graduate Preferences'!JI4=0,\"\",'Graduate Preferences'!JI4)","v":""},{"$f":"IF('Graduate Preferences'!JJ4=0,\"\",'Graduate Preferences'!JJ4)","v":""},{"$f":"IF('Graduate Preferences'!JK4=0,\"\",'Graduate Preferences'!JK4)","v":""},{"$f":"IF('Graduate Preferences'!JL4=0,\"\",'Graduate Preferences'!JL4)","v":""},{"$f":"IF('Graduate Preferences'!JM4=0,\"\",'Graduate Preferences'!JM4)","v":""},{"$f":"IF('Graduate Preferences'!JN4=0,\"\",'Graduate Preferences'!JN4)","v":""},{"$f":"IF('Graduate Preferences'!JO4=0,\"\",'Graduate Preferences'!JO4)","v":""},{"$f":"IF('Graduate Preferences'!JP4=0,\"\",'Graduate Preferences'!JP4)","v":""},{"$f":"IF('Graduate Preferences'!JQ4=0,\"\",'Graduate Preferences'!JQ4)","v":""},{"$f":"IF('Graduate Preferences'!JR4=0,\"\",'Graduate Preferences'!JR4)","v":""},{"$f":"IF('Graduate Preferences'!JS4=0,\"\",'Graduate Preferences'!JS4)","v":""},{"$f":"IF('Graduate Preferences'!JT4=0,\"\",'Graduate Preferences'!JT4)","v":""},{"$f":"IF('Graduate Preferences'!JU4=0,\"\",'Graduate Preferences'!JU4)","v":""},{"$f":"IF('Graduate Preferences'!JV4=0,\"\",'Graduate Preferences'!JV4)","v":""},{"$f":"IF('Graduate Preferences'!JW4=0,\"\",'Graduate Preferences'!JW4)","v":""},{"$f":"IF('Graduate Preferences'!JX4=0,\"\",'Graduate Preferences'!JX4)","v":""},{"$f":"IF('Graduate Preferences'!JY4=0,\"\",'Graduate Preferences'!JY4)","v":""},{"$f":"IF('Graduate Preferences'!JZ4=0,\"\",'Graduate Preferences'!JZ4)","v":""},{"$f":"IF('Graduate Preferences'!KA4=0,\"\",'Graduate Preferences'!KA4)","v":""},{"$f":"IF('Graduate Preferences'!KB4=0,\"\",'Graduate Preferences'!KB4)","v":""},{"$f":"IF('Graduate Preferences'!KC4=0,\"\",'Graduate Preferences'!KC4)","v":""},{"$f":"IF('Graduate Preferences'!KD4=0,\"\",'Graduate Preferences'!KD4)","v":""},{"$f":"IF('Graduate Preferences'!KE4=0,\"\",'Graduate Preferences'!KE4)","v":""},{"$f":"IF('Graduate Preferences'!KF4=0,\"\",'Graduate Preferences'!KF4)","v":""},{"$f":"IF('Graduate Preferences'!KG4=0,\"\",'Graduate Preferences'!KG4)","v":""},{"$f":"IF('Graduate Preferences'!KH4=0,\"\",'Graduate Preferences'!KH4)","v":""},{"$f":"IF('Graduate Preferences'!KI4=0,\"\",'Graduate Preferences'!KI4)","v":""},{"$f":"IF('Graduate Preferences'!KJ4=0,\"\",'Graduate Preferences'!KJ4)","v":""},{"$f":"IF('Graduate Preferences'!KK4=0,\"\",'Graduate Preferences'!KK4)","v":""},{"$f":"IF('Graduate Preferences'!KL4=0,\"\",'Graduate Preferences'!KL4)","v":""},{"$f":"IF('Graduate Preferences'!KM4=0,\"\",'Graduate Preferences'!KM4)","v":""},{"$f":"IF('Graduate Preferences'!KN4=0,\"\",'Graduate Preferences'!KN4)","v":""},{"$f":"IF('Graduate Preferences'!KO4=0,\"\",'Graduate Preferences'!KO4)","v":""},{"$f":"IF('Graduate Preferences'!KP4=0,\"\",'Graduate Preferences'!KP4)","v":""},{"$f":"IF('Graduate Preferences'!KQ4=0,\"\",'Graduate Preferences'!KQ4)","v":""},{"$f":"IF('Graduate Preferences'!KR4=0,\"\",'Graduate Preferences'!KR4)","v":""},{"$f":"IF('Graduate Preferences'!KS4=0,\"\",'Graduate Preferences'!KS4)","v":""},{"$f":"IF('Graduate Preferences'!KT4=0,\"\",'Graduate Preferences'!KT4)","v":""},{"$f":"IF('Graduate Preferences'!KU4=0,\"\",'Graduate Preferences'!KU4)","v":""},{"$f":"IF('Graduate Preferences'!KV4=0,\"\",'Graduate Preferences'!KV4)","v":""},{"$f":"IF('Graduate Preferences'!KW4=0,\"\",'Graduate Preferences'!KW4)","v":""},{"$f":"IF('Graduate Preferences'!KX4=0,\"\",'Graduate Preferences'!KX4)","v":""},{"$f":"IF('Graduate Preferences'!KY4=0,\"\",'Graduate Preferences'!KY4)","v":""},{"$f":"IF('Graduate Preferences'!KZ4=0,\"\",'Graduate Preferences'!KZ4)","v":""},{"$f":"IF('Graduate Preferences'!LA4=0,\"\",'Graduate Preferences'!LA4)","v":""},{"$f":"IF('Graduate Preferences'!LB4=0,\"\",'Graduate Preferences'!LB4)","v":""},{"$f":"IF('Graduate Preferences'!LC4=0,\"\",'Graduate Preferences'!LC4)","v":""},{"$f":"IF('Graduate Preferences'!LD4=0,\"\",'Graduate Preferences'!LD4)","v":""},{"$f":"IF('Graduate Preferences'!LE4=0,\"\",'Graduate Preferences'!LE4)","v":""},{"$f":"IF('Graduate Preferences'!LF4=0,\"\",'Graduate Preferences'!LF4)","v":""},{"$f":"IF('Graduate Preferences'!LG4=0,\"\",'Graduate Preferences'!LG4)","v":""},{"$f":"IF('Graduate Preferences'!LH4=0,\"\",'Graduate Preferences'!LH4)","v":""},{"$f":"IF('Graduate Preferences'!LI4=0,\"\",'Graduate Preferences'!LI4)","v":""},{"$f":"IF('Graduate Preferences'!LJ4=0,\"\",'Graduate Preferences'!LJ4)","v":""},{"$f":"IF('Graduate Preferences'!LK4=0,\"\",'Graduate Preferences'!LK4)","v":""},{"$f":"IF('Graduate Preferences'!LL4=0,\"\",'Graduate Preferences'!LL4)","v":""},{"$f":"IF('Graduate Preferences'!LM4=0,\"\",'Graduate Preferences'!LM4)","v":""},{"$f":"IF('Graduate Preferences'!LN4=0,\"\",'Graduate Preferences'!LN4)","v":""},{"$f":"IF('Graduate Preferences'!LO4=0,\"\",'Graduate Preferences'!LO4)","v":""},{"$f":"IF('Graduate Preferences'!LP4=0,\"\",'Graduate Preferences'!LP4)","v":""},{"$f":"IF('Graduate Preferences'!LQ4=0,\"\",'Graduate Preferences'!LQ4)","v":""},{"$f":"IF('Graduate Preferences'!LR4=0,\"\",'Graduate Preferences'!LR4)","v":""},{"$f":"IF('Graduate Preferences'!LS4=0,\"\",'Graduate Preferences'!LS4)","v":""},{"$f":"IF('Graduate Preferences'!LT4=0,\"\",'Graduate Preferences'!LT4)","v":""},{"$f":"IF('Graduate Preferences'!LU4=0,\"\",'Graduate Preferences'!LU4)","v":""},{"$f":"IF('Graduate Preferences'!LV4=0,\"\",'Graduate Preferences'!LV4)","v":""},{"$f":"IF('Graduate Preferences'!LW4=0,\"\",'Graduate Preferences'!LW4)","v":""},{"$f":"IF('Graduate Preferences'!LX4=0,\"\",'Graduate Preferences'!LX4)","v":""},{"$f":"IF('Graduate Preferences'!LY4=0,\"\",'Graduate Preferences'!LY4)","v":""},{"$f":"IF('Graduate Preferences'!LZ4=0,\"\",'Graduate Preferences'!LZ4)","v":""},{"$f":"IF('Graduate Preferences'!MA4=0,\"\",'Graduate Preferences'!MA4)","v":""},{"$f":"IF('Graduate Preferences'!MB4=0,\"\",'Graduate Preferences'!MB4)","v":""},{"$f":"IF('Graduate Preferences'!MC4=0,\"\",'Graduate Preferences'!MC4)","v":""},{"$f":"IF('Graduate Preferences'!MD4=0,\"\",'Graduate Preferences'!MD4)","v":""},{"$f":"IF('Graduate Preferences'!ME4=0,\"\",'Graduate Preferences'!ME4)","v":""},{"$f":"IF('Graduate Preferences'!MF4=0,\"\",'Graduate Preferences'!MF4)","v":""},{"$f":"IF('Graduate Preferences'!MG4=0,\"\",'Graduate Preferences'!MG4)","v":""},{"$f":"IF('Graduate Preferences'!MH4=0,\"\",'Graduate Preferences'!MH4)","v":""},{"$f":"IF('Graduate Preferences'!MI4=0,\"\",'Graduate Preferences'!MI4)","v":""},{"$f":"IF('Graduate Preferences'!MJ4=0,\"\",'Graduate Preferences'!MJ4)","v":""},{"$f":"IF('Graduate Preferences'!MK4=0,\"\",'Graduate Preferences'!MK4)","v":""},{"$f":"IF('Graduate Preferences'!ML4=0,\"\",'Graduate Preferences'!ML4)","v":""},{"$f":"IF('Graduate Preferences'!MM4=0,\"\",'Graduate Preferences'!MM4)","v":""},{"$f":"IF('Graduate Preferences'!MN4=0,\"\",'Graduate Preferences'!MN4)","v":""},{"$f":"IF('Graduate Preferences'!MO4=0,\"\",'Graduate Preferences'!MO4)","v":""},{"$f":"IF('Graduate Preferences'!MP4=0,\"\",'Graduate Preferences'!MP4)","v":""},{"$f":"IF('Graduate Preferences'!MQ4=0,\"\",'Graduate Preferences'!MQ4)","v":""},{"$f":"IF('Graduate Preferences'!MR4=0,\"\",'Graduate Preferences'!MR4)","v":""},{"$f":"IF('Graduate Preferences'!MS4=0,\"\",'Graduate Preferences'!MS4)","v":""},{"$f":"IF('Graduate Preferences'!MT4=0,\"\",'Graduate Preferences'!MT4)","v":""},{"$f":"IF('Graduate Preferences'!MU4=0,\"\",'Graduate Preferences'!MU4)","v":""},{"$f":"IF('Graduate Preferences'!MV4=0,\"\",'Graduate Preferences'!MV4)","v":""},{"$f":"IF('Graduate Preferences'!MW4=0,\"\",'Graduate Preferences'!MW4)","v":""},{"$f":"IF('Graduate Preferences'!MX4=0,\"\",'Graduate Preferences'!MX4)","v":""},{"$f":"IF('Graduate Preferences'!MY4=0,\"\",'Graduate Preferences'!MY4)","v":""},{"$f":"IF('Graduate Preferences'!MZ4=0,\"\",'Graduate Preferences'!MZ4)","v":""},{"$f":"IF('Graduate Preferences'!NA4=0,\"\",'Graduate Preferences'!NA4)","v":""},{"$f":"IF('Graduate Preferences'!NB4=0,\"\",'Graduate Preferences'!NB4)","v":""},{"$f":"IF('Graduate Preferences'!NC4=0,\"\",'Graduate Preferences'!NC4)","v":""},{"$f":"IF('Graduate Preferences'!ND4=0,\"\",'Graduate Preferences'!ND4)","v":""},{"$f":"IF('Graduate Preferences'!NE4=0,\"\",'Graduate Preferences'!NE4)","v":""},{"$f":"IF('Graduate Preferences'!NF4=0,\"\",'Graduate Preferences'!NF4)","v":""},{"$f":"IF('Graduate Preferences'!NG4=0,\"\",'Graduate Preferences'!NG4)","v":""},{"$f":"IF('Graduate Preferences'!NH4=0,\"\",'Graduate Preferences'!NH4)","v":""},{"$f":"IF('Graduate Preferences'!NI4=0,\"\",'Graduate Preferences'!NI4)","v":""},{"$f":"IF('Graduate Preferences'!NJ4=0,\"\",'Graduate Preferences'!NJ4)","v":""},{"$f":"IF('Graduate Preferences'!NK4=0,\"\",'Graduate Preferences'!NK4)","v":""},{"$f":"IF('Graduate Preferences'!NL4=0,\"\",'Graduate Preferences'!NL4)","v":""},{"$f":"IF('Graduate Preferences'!NM4=0,\"\",'Graduate Preferences'!NM4)","v":""},{"$f":"IF('Graduate Preferences'!NN4=0,\"\",'Graduate Preferences'!NN4)","v":""},{"$f":"IF('Graduate Preferences'!NO4=0,\"\",'Graduate Preferences'!NO4)","v":""},{"$f":"IF('Graduate Preferences'!NP4=0,\"\",'Graduate Preferences'!NP4)","v":""},{"$f":"IF('Graduate Preferences'!NQ4=0,\"\",'Graduate Preferences'!NQ4)","v":""},{"$f":"IF('Graduate Preferences'!NR4=0,\"\",'Graduate Preferences'!NR4)","v":""},{"$f":"IF('Graduate Preferences'!NS4=0,\"\",'Graduate Preferences'!NS4)","v":""},{"$f":"IF('Graduate Preferences'!NT4=0,\"\",'Graduate Preferences'!NT4)","v":""},{"$f":"IF('Graduate Preferences'!NU4=0,\"\",'Graduate Preferences'!NU4)","v":""},{"$f":"IF('Graduate Preferences'!NV4=0,\"\",'Graduate Preferences'!NV4)","v":""},{"$f":"IF('Graduate Preferences'!NW4=0,\"\",'Graduate Preferences'!NW4)","v":""},{"$f":"IF('Graduate Preferences'!NX4=0,\"\",'Graduate Preferences'!NX4)","v":""},{"$f":"IF('Graduate Preferences'!NY4=0,\"\",'Graduate Preferences'!NY4)","v":""},{"$f":"IF('Graduate Preferences'!NZ4=0,\"\",'Graduate Preferences'!NZ4)","v":""},{"$f":"IF('Graduate Preferences'!OA4=0,\"\",'Graduate Preferences'!OA4)","v":""},{"$f":"IF('Graduate Preferences'!OB4=0,\"\",'Graduate Preferences'!OB4)","v":""},{"$f":"IF('Graduate Preferences'!OC4=0,\"\",'Graduate Preferences'!OC4)","v":""},{"$f":"IF('Graduate Preferences'!OD4=0,\"\",'Graduate Preferences'!OD4)","v":""},{"$f":"IF('Graduate Preferences'!OE4=0,\"\",'Graduate Preferences'!OE4)","v":""},{"$f":"IF('Graduate Preferences'!OF4=0,\"\",'Graduate Preferences'!OF4)","v":""},{"$f":"IF('Graduate Preferences'!OG4=0,\"\",'Graduate Preferences'!OG4)","v":""},{"$f":"IF('Graduate Preferences'!OH4=0,\"\",'Graduate Preferences'!OH4)","v":""},{"$f":"IF('Graduate Preferences'!OI4=0,\"\",'Graduate Preferences'!OI4)","v":""},{"$f":"IF('Graduate Preferences'!OJ4=0,\"\",'Graduate Preferences'!OJ4)","v":""},{"$f":"IF('Graduate Preferences'!OK4=0,\"\",'Graduate Preferences'!OK4)","v":""},{"$f":"IF('Graduate Preferences'!OL4=0,\"\",'Graduate Preferences'!OL4)","v":""},{"$f":"IF('Graduate Preferences'!OM4=0,\"\",'Graduate Preferences'!OM4)","v":""},{"$f":"IF('Graduate Preferences'!ON4=0,\"\",'Graduate Preferences'!ON4)","v":""},{"$f":"IF('Graduate Preferences'!OO4=0,\"\",'Graduate Preferences'!OO4)","v":""},{"$f":"IF('Graduate Preferences'!OP4=0,\"\",'Graduate Preferences'!OP4)","v":""},{"$f":"IF('Graduate Preferences'!OQ4=0,\"\",'Graduate Preferences'!OQ4)","v":""},{"$f":"IF('Graduate Preferences'!OR4=0,\"\",'Graduate Preferences'!OR4)","v":""},{"$f":"IF('Graduate Preferences'!OS4=0,\"\",'Graduate Preferences'!OS4)","v":""},{"$f":"IF('Graduate Preferences'!OT4=0,\"\",'Graduate Preferences'!OT4)","v":""},{"$f":"IF('Graduate Preferences'!OU4=0,\"\",'Graduate Preferences'!OU4)","v":""},{"$f":"IF('Graduate Preferences'!OV4=0,\"\",'Graduate Preferences'!OV4)","v":""},{"$f":"IF('Graduate Preferences'!OW4=0,\"\",'Graduate Preferences'!OW4)","v":""},{"$f":"IF('Graduate Preferences'!OX4=0,\"\",'Graduate Preferences'!OX4)","v":""},{"$f":"IF('Graduate Preferences'!OY4=0,\"\",'Graduate Preferences'!OY4)","v":""},{"$f":"IF('Graduate Preferences'!OZ4=0,\"\",'Graduate Preferences'!OZ4)","v":""},{"$f":"IF('Graduate Preferences'!PA4=0,\"\",'Graduate Preferences'!PA4)","v":""},{"$f":"IF('Graduate Preferences'!PB4=0,\"\",'Graduate Preferences'!PB4)","v":""},{"$f":"IF('Graduate Preferences'!PC4=0,\"\",'Graduate Preferences'!PC4)","v":""},{"$f":"IF('Graduate Preferences'!PD4=0,\"\",'Graduate Preferences'!PD4)","v":""},{"$f":"IF('Graduate Preferences'!PE4=0,\"\",'Graduate Preferences'!PE4)","v":""},{"$f":"IF('Graduate Preferences'!PF4=0,\"\",'Graduate Preferences'!PF4)","v":""},{"$f":"IF('Graduate Preferences'!PG4=0,\"\",'Graduate Preferences'!PG4)","v":""},{"$f":"IF('Graduate Preferences'!PH4=0,\"\",'Graduate Preferences'!PH4)","v":""},{"$f":"IF('Graduate Preferences'!PI4=0,\"\",'Graduate Preferences'!PI4)","v":""},{"$f":"IF('Graduate Preferences'!PJ4=0,\"\",'Graduate Preferences'!PJ4)","v":""},{"$f":"IF('Graduate Preferences'!PK4=0,\"\",'Graduate Preferences'!PK4)","v":""},{"$f":"IF('Graduate Preferences'!PL4=0,\"\",'Graduate Preferences'!PL4)","v":""},{"$f":"IF('Graduate Preferences'!PM4=0,\"\",'Graduate Preferences'!PM4)","v":""},{"$f":"IF('Graduate Preferences'!PN4=0,\"\",'Graduate Preferences'!PN4)","v":""},{"$f":"IF('Graduate Preferences'!PO4=0,\"\",'Graduate Preferences'!PO4)","v":""},{"$f":"IF('Graduate Preferences'!PP4=0,\"\",'Graduate Preferences'!PP4)","v":""},{"$f":"IF('Graduate Preferences'!PQ4=0,\"\",'Graduate Preferences'!PQ4)","v":""},{"$f":"IF('Graduate Preferences'!PR4=0,\"\",'Graduate Preferences'!PR4)","v":""},{"$f":"IF('Graduate Preferences'!PS4=0,\"\",'Graduate Preferences'!PS4)","v":""},{"$f":"IF('Graduate Preferences'!PT4=0,\"\",'Graduate Preferences'!PT4)","v":""},{"$f":"IF('Graduate Preferences'!PU4=0,\"\",'Graduate Preferences'!PU4)","v":""},{"$f":"IF('Graduate Preferences'!PV4=0,\"\",'Graduate Preferences'!PV4)","v":""},{"$f":"IF('Graduate Preferences'!PW4=0,\"\",'Graduate Preferences'!PW4)","v":""},{"$f":"IF('Graduate Preferences'!PX4=0,\"\",'Graduate Preferences'!PX4)","v":""},{"$f":"IF('Graduate Preferences'!PY4=0,\"\",'Graduate Preferences'!PY4)","v":""},{"$f":"IF('Graduate Preferences'!PZ4=0,\"\",'Graduate Preferences'!PZ4)","v":""},{"$f":"IF('Graduate Preferences'!QA4=0,\"\",'Graduate Preferences'!QA4)","v":""},{"$f":"IF('Graduate Preferences'!QB4=0,\"\",'Graduate Preferences'!QB4)","v":""},{"$f":"IF('Graduate Preferences'!QC4=0,\"\",'Graduate Preferences'!QC4)","v":""},{"$f":"IF('Graduate Preferences'!QD4=0,\"\",'Graduate Preferences'!QD4)","v":""},{"$f":"IF('Graduate Preferences'!QE4=0,\"\",'Graduate Preferences'!QE4)","v":""},{"$f":"IF('Graduate Preferences'!QF4=0,\"\",'Graduate Preferences'!QF4)","v":""},{"$f":"IF('Graduate Preferences'!QG4=0,\"\",'Graduate Preferences'!QG4)","v":""},{"$f":"IF('Graduate Preferences'!QH4=0,\"\",'Graduate Preferences'!QH4)","v":""},{"$f":"IF('Graduate Preferences'!QI4=0,\"\",'Graduate Preferences'!QI4)","v":""},{"$f":"IF('Graduate Preferences'!QJ4=0,\"\",'Graduate Preferences'!QJ4)","v":""},{"$f":"IF('Graduate Preferences'!QK4=0,\"\",'Graduate Preferences'!QK4)","v":""},{"$f":"IF('Graduate Preferences'!QL4=0,\"\",'Graduate Preferences'!QL4)","v":""},{"$f":"IF('Graduate Preferences'!QM4=0,\"\",'Graduate Preferences'!QM4)","v":""},{"$f":"IF('Graduate Preferences'!QN4=0,\"\",'Graduate Preferences'!QN4)","v":""},{"$f":"IF('Graduate Preferences'!QO4=0,\"\",'Graduate Preferences'!QO4)","v":""},{"$f":"IF('Graduate Preferences'!QP4=0,\"\",'Graduate Preferences'!QP4)","v":""},{"$f":"IF('Graduate Preferences'!QQ4=0,\"\",'Graduate Preferences'!QQ4)","v":""},{"$f":"IF('Graduate Preferences'!QR4=0,\"\",'Graduate Preferences'!QR4)","v":""},{"$f":"IF('Graduate Preferences'!QS4=0,\"\",'Graduate Preferences'!QS4)","v":""},{"$f":"IF('Graduate Preferences'!QT4=0,\"\",'Graduate Preferences'!QT4)","v":""},{"$f":"IF('Graduate Preferences'!QU4=0,\"\",'Graduate Preferences'!QU4)","v":""},{"$f":"IF('Graduate Preferences'!QV4=0,\"\",'Graduate Preferences'!QV4)","v":""},{"$f":"IF('Graduate Preferences'!QW4=0,\"\",'Graduate Preferences'!QW4)","v":""},{"$f":"IF('Graduate Preferences'!QX4=0,\"\",'Graduate Preferences'!QX4)","v":""},{"$f":"IF('Graduate Preferences'!QY4=0,\"\",'Graduate Preferences'!QY4)","v":""},{"$f":"IF('Graduate Preferences'!QZ4=0,\"\",'Graduate Preferences'!QZ4)","v":""},{"$f":"IF('Graduate Preferences'!RA4=0,\"\",'Graduate Preferences'!RA4)","v":""},{"$f":"IF('Graduate Preferences'!RB4=0,\"\",'Graduate Preferences'!RB4)","v":""},{"$f":"IF('Graduate Preferences'!RC4=0,\"\",'Graduate Preferences'!RC4)","v":""},{"$f":"IF('Graduate Preferences'!RD4=0,\"\",'Graduate Preferences'!RD4)","v":""},{"$f":"IF('Graduate Preferences'!RE4=0,\"\",'Graduate Preferences'!RE4)","v":""},{"$f":"IF('Graduate Preferences'!RF4=0,\"\",'Graduate Preferences'!RF4)","v":""},{"$f":"IF('Graduate Preferences'!RG4=0,\"\",'Graduate Preferences'!RG4)","v":""},{"$f":"IF('Graduate Preferences'!RH4=0,\"\",'Graduate Preferences'!RH4)","v":""},{"$f":"IF('Graduate Preferences'!RI4=0,\"\",'Graduate Preferences'!RI4)","v":""},{"$f":"IF('Graduate Preferences'!RJ4=0,\"\",'Graduate Preferences'!RJ4)","v":""},{"$f":"IF('Graduate Preferences'!RK4=0,\"\",'Graduate Preferences'!RK4)","v":""},{"$f":"IF('Graduate Preferences'!RL4=0,\"\",'Graduate Preferences'!RL4)","v":""},{"$f":"IF('Graduate Preferences'!RM4=0,\"\",'Graduate Preferences'!RM4)","v":""},{"$f":"IF('Graduate Preferences'!RN4=0,\"\",'Graduate Preferences'!RN4)","v":""},{"$f":"IF('Graduate Preferences'!RO4=0,\"\",'Graduate Preferences'!RO4)","v":""},{"$f":"IF('Graduate Preferences'!RP4=0,\"\",'Graduate Preferences'!RP4)","v":""},{"$f":"IF('Graduate Preferences'!RQ4=0,\"\",'Graduate Preferences'!RQ4)","v":""},{"$f":"IF('Graduate Preferences'!RR4=0,\"\",'Graduate Preferences'!RR4)","v":""},{"$f":"IF('Graduate Preferences'!RS4=0,\"\",'Graduate Preferences'!RS4)","v":""},{"$f":"IF('Graduate Preferences'!RT4=0,\"\",'Graduate Preferences'!RT4)","v":""},{"$f":"IF('Graduate Preferences'!RU4=0,\"\",'Graduate Preferences'!RU4)","v":""},{"$f":"IF('Graduate Preferences'!RV4=0,\"\",'Graduate Preferences'!RV4)","v":""},{"$f":"IF('Graduate Preferences'!RW4=0,\"\",'Graduate Preferences'!RW4)","v":""},{"$f":"IF('Graduate Preferences'!RX4=0,\"\",'Graduate Preferences'!RX4)","v":""},{"$f":"IF('Graduate Preferences'!RY4=0,\"\",'Graduate Preferences'!RY4)","v":""},{"$f":"IF('Graduate Preferences'!RZ4=0,\"\",'Graduate Preferences'!RZ4)","v":""},{"$f":"IF('Graduate Preferences'!SA4=0,\"\",'Graduate Preferences'!SA4)","v":""},{"$f":"IF('Graduate Preferences'!SB4=0,\"\",'Graduate Preferences'!SB4)","v":""},{"$f":"IF('Graduate Preferences'!SC4=0,\"\",'Graduate Preferences'!SC4)","v":""},{"$f":"IF('Graduate Preferences'!SD4=0,\"\",'Graduate Preferences'!SD4)","v":""},{"$f":"IF('Graduate Preferences'!SE4=0,\"\",'Graduate Preferences'!SE4)","v":""},{"$f":"IF('Graduate Preferences'!SF4=0,\"\",'Graduate Preferences'!SF4)","v":""},{"$f":"IF('Graduate Preferences'!SG4=0,\"\",'Graduate Preferences'!SG4)","v":""},{"$f":"IF('Graduate Preferences'!SH4=0,\"\",'Graduate Preferences'!SH4)","v":""},{"$f":"IF('Graduate Preferences'!SI4=0,\"\",'Graduate Preferences'!SI4)","v":""},{"$f":"IF('Graduate Preferences'!SJ4=0,\"\",'Graduate Preferences'!SJ4)","v":""},{"$f":"IF('Graduate Preferences'!SK4=0,\"\",'Graduate Preferences'!SK4)","v":""},{"$f":"IF('Graduate Preferences'!SL4=0,\"\",'Graduate Preferences'!SL4)","v":""},{"$f":"IF('Graduate Preferences'!SM4=0,\"\",'Graduate Preferences'!SM4)","v":""},{"$f":"IF('Graduate Preferences'!SN4=0,\"\",'Graduate Preferences'!SN4)","v":""},{"$f":"IF('Graduate Preferences'!SO4=0,\"\",'Graduate Preferences'!SO4)","v":""},{"$f":"IF('Graduate Preferences'!SP4=0,\"\",'Graduate Preferences'!SP4)","v":""},{"$f":"IF('Graduate Preferences'!SQ4=0,\"\",'Graduate Preferences'!SQ4)","v":""},{"$f":"IF('Graduate Preferences'!SR4=0,\"\",'Graduate Preferences'!SR4)","v":""},{"$f":"IF('Graduate Preferences'!SS4=0,\"\",'Graduate Preferences'!SS4)","v":""},{"$f":"IF('Graduate Preferences'!ST4=0,\"\",'Graduate Preferences'!ST4)","v":""},{"$f":"IF('Graduate Preferences'!SU4=0,\"\",'Graduate Preferences'!SU4)","v":""},{"$f":"IF('Graduate Preferences'!SV4=0,\"\",'Graduate Preferences'!SV4)","v":""},{"$f":"IF('Graduate Preferences'!SW4=0,\"\",'Graduate Preferences'!SW4)","v":""},{"$f":"IF('Graduate Preferences'!SX4=0,\"\",'Graduate Preferences'!SX4)","v":""},{"$f":"IF('Graduate Preferences'!SY4=0,\"\",'Graduate Preferences'!SY4)","v":""},{"$f":"IF('Graduate Preferences'!SZ4=0,\"\",'Graduate Preferences'!SZ4)","v":""},{"$f":"IF('Graduate Preferences'!TA4=0,\"\",'Graduate Preferences'!TA4)","v":""},{"$f":"IF('Graduate Preferences'!TB4=0,\"\",'Graduate Preferences'!TB4)","v":""},{"$f":"IF('Graduate Preferences'!TC4=0,\"\",'Graduate Preferences'!TC4)","v":""},{"$f":"IF('Graduate Preferences'!TD4=0,\"\",'Graduate Preferences'!TD4)","v":""},{"$f":"IF('Graduate Preferences'!TE4=0,\"\",'Graduate Preferences'!TE4)","v":""},{"$f":"IF('Graduate Preferences'!TF4=0,\"\",'Graduate Preferences'!TF4)","v":""},{"$f":"IF('Graduate Preferences'!TG4=0,\"\",'Graduate Preferences'!TG4)","v":""},{"$f":"IF('Graduate Preferences'!TH4=0,\"\",'Graduate Preferences'!TH4)","v":""},{"$f":"IF('Graduate Preferences'!TI4=0,\"\",'Graduate Preferences'!TI4)","v":""},{"$f":"IF('Graduate Preferences'!TJ4=0,\"\",'Graduate Preferences'!TJ4)","v":""},{"$f":"IF('Graduate Preferences'!TK4=0,\"\",'Graduate Preferences'!TK4)","v":""},{"$f":"IF('Graduate Preferences'!TL4=0,\"\",'Graduate Preferences'!TL4)","v":""},{"$f":"IF('Graduate Preferences'!TM4=0,\"\",'Graduate Preferences'!TM4)","v":""},{"$f":"IF('Graduate Preferences'!TN4=0,\"\",'Graduate Preferences'!TN4)","v":""},{"$f":"IF('Graduate Preferences'!TO4=0,\"\",'Graduate Preferences'!TO4)","v":""},{"$f":"IF('Graduate Preferences'!TP4=0,\"\",'Graduate Preferences'!TP4)","v":""},{"$f":"IF('Graduate Preferences'!TQ4=0,\"\",'Graduate Preferences'!TQ4)","v":""},{"$f":"IF('Graduate Preferences'!TR4=0,\"\",'Graduate Preferences'!TR4)","v":""},{"$f":"IF('Graduate Preferences'!TS4=0,\"\",'Graduate Preferences'!TS4)","v":""},{"$f":"IF('Graduate Preferences'!TT4=0,\"\",'Graduate Preferences'!TT4)","v":""},{"$f":"IF('Graduate Preferences'!TU4=0,\"\",'Graduate Preferences'!TU4)","v":""},{"$f":"IF('Graduate Preferences'!TV4=0,\"\",'Graduate Preferences'!TV4)","v":""},{"$f":"IF('Graduate Preferences'!TW4=0,\"\",'Graduate Preferences'!TW4)","v":""},{"$f":"IF('Graduate Preferences'!TX4=0,\"\",'Graduate Preferences'!TX4)","v":""},{"$f":"IF('Graduate Preferences'!TY4=0,\"\",'Graduate Preferences'!TY4)","v":""},{"$f":"IF('Graduate Preferences'!TZ4=0,\"\",'Graduate Preferences'!TZ4)","v":""},{"$f":"IF('Graduate Preferences'!UA4=0,\"\",'Graduate Preferences'!UA4)","v":""},{"$f":"IF('Graduate Preferences'!UB4=0,\"\",'Graduate Preferences'!UB4)","v":""},{"$f":"IF('Graduate Preferences'!UC4=0,\"\",'Graduate Preferences'!UC4)","v":""},{"$f":"IF('Graduate Preferences'!UD4=0,\"\",'Graduate Preferences'!UD4)","v":""},{"$f":"IF('Graduate Preferences'!UE4=0,\"\",'Graduate Preferences'!UE4)","v":""},{"$f":"IF('Graduate Preferences'!UF4=0,\"\",'Graduate Preferences'!UF4)","v":""},{"$f":"IF('Graduate Preferences'!UG4=0,\"\",'Graduate Preferences'!UG4)","v":""},{"$f":"IF('Graduate Preferences'!UH4=0,\"\",'Graduate Preferences'!UH4)","v":""},{"$f":"IF('Graduate Preferences'!UI4=0,\"\",'Graduate Preferences'!UI4)","v":""},{"$f":"IF('Graduate Preferences'!UJ4=0,\"\",'Graduate Preferences'!UJ4)","v":""},{"$f":"IF('Graduate Preferences'!UK4=0,\"\",'Graduate Preferences'!UK4)","v":""},{"$f":"IF('Graduate Preferences'!UL4=0,\"\",'Graduate Preferences'!UL4)","v":""},{"$f":"IF('Graduate Preferences'!UM4=0,\"\",'Graduate Preferences'!UM4)","v":""},{"$f":"IF('Graduate Preferences'!UN4=0,\"\",'Graduate Preferences'!UN4)","v":""},{"$f":"IF('Graduate Preferences'!UO4=0,\"\",'Graduate Preferences'!UO4)","v":""},{"$f":"IF('Graduate Preferences'!UP4=0,\"\",'Graduate Preferences'!UP4)","v":""},{"$f":"IF('Graduate Preferences'!UQ4=0,\"\",'Graduate Preferences'!UQ4)","v":""},{"$f":"IF('Graduate Preferences'!UR4=0,\"\",'Graduate Preferences'!UR4)","v":""},{"$f":"IF('Graduate Preferences'!US4=0,\"\",'Graduate Preferences'!US4)","v":""},{"$f":"IF('Graduate Preferences'!UT4=0,\"\",'Graduate Preferences'!UT4)","v":""},{"$f":"IF('Graduate Preferences'!UU4=0,\"\",'Graduate Preferences'!UU4)","v":""},{"$f":"IF('Graduate Preferences'!UV4=0,\"\",'Graduate Preferences'!UV4)","v":""},{"$f":"IF('Graduate Preferences'!UW4=0,\"\",'Graduate Preferences'!UW4)","v":""},{"$f":"IF('Graduate Preferences'!UX4=0,\"\",'Graduate Preferences'!UX4)","v":""},{"$f":"IF('Graduate Preferences'!UY4=0,\"\",'Graduate Preferences'!UY4)","v":""},{"$f":"IF('Graduate Preferences'!UZ4=0,\"\",'Graduate Preferences'!UZ4)","v":""},{"$f":"IF('Graduate Preferences'!VA4=0,\"\",'Graduate Preferences'!VA4)","v":""},{"$f":"IF('Graduate Preferences'!VB4=0,\"\",'Graduate Preferences'!VB4)","v":""},{"$f":"IF('Graduate Preferences'!VC4=0,\"\",'Graduate Preferences'!VC4)","v":""},{"$f":"IF('Graduate Preferences'!VD4=0,\"\",'Graduate Preferences'!VD4)","v":""},{"$f":"IF('Graduate Preferences'!VE4=0,\"\",'Graduate Preferences'!VE4)","v":""},{"$f":"IF('Graduate Preferences'!VF4=0,\"\",'Graduate Preferences'!VF4)","v":""},{"$f":"IF('Graduate Preferences'!VG4=0,\"\",'Graduate Preferences'!VG4)","v":""},{"$f":"IF('Graduate Preferences'!VH4=0,\"\",'Graduate Preferences'!VH4)","v":""},{"$f":"IF('Graduate Preferences'!VI4=0,\"\",'Graduate Preferences'!VI4)","v":""},{"$f":"IF('Graduate Preferences'!VJ4=0,\"\",'Graduate Preferences'!VJ4)","v":""},{"$f":"IF('Graduate Preferences'!VK4=0,\"\",'Graduate Preferences'!VK4)","v":""},{"$f":"IF('Graduate Preferences'!VL4=0,\"\",'Graduate Preferences'!VL4)","v":""},{"$f":"IF('Graduate Preferences'!VM4=0,\"\",'Graduate Preferences'!VM4)","v":""},{"$f":"IF('Graduate Preferences'!VN4=0,\"\",'Graduate Preferences'!VN4)","v":""},{"$f":"IF('Graduate Preferences'!VO4=0,\"\",'Graduate Preferences'!VO4)","v":""},{"$f":"IF('Graduate Preferences'!VP4=0,\"\",'Graduate Preferences'!VP4)","v":""},{"$f":"IF('Graduate Preferences'!VQ4=0,\"\",'Graduate Preferences'!VQ4)","v":""},{"$f":"IF('Graduate Preferences'!VR4=0,\"\",'Graduate Preferences'!VR4)","v":""},{"$f":"IF('Graduate Preferences'!VS4=0,\"\",'Graduate Preferences'!VS4)","v":""},{"$f":"IF('Graduate Preferences'!VT4=0,\"\",'Graduate Preferences'!VT4)","v":""},{"$f":"IF('Graduate Preferences'!VU4=0,\"\",'Graduate Preferences'!VU4)","v":""},{"$f":"IF('Graduate Preferences'!VV4=0,\"\",'Graduate Preferences'!VV4)","v":""},{"$f":"IF('Graduate Preferences'!VW4=0,\"\",'Graduate Preferences'!VW4)","v":""},{"$f":"IF('Graduate Preferences'!VX4=0,\"\",'Graduate Preferences'!VX4)","v":""},{"$f":"IF('Graduate Preferences'!VY4=0,\"\",'Graduate Preferences'!VY4)","v":""},{"$f":"IF('Graduate Preferences'!VZ4=0,\"\",'Graduate Preferences'!VZ4)","v":""},{"$f":"IF('Graduate Preferences'!WA4=0,\"\",'Graduate Preferences'!WA4)","v":""},{"$f":"IF('Graduate Preferences'!WB4=0,\"\",'Graduate Preferences'!WB4)","v":""},{"$f":"IF('Graduate Preferences'!WC4=0,\"\",'Graduate Preferences'!WC4)","v":""},{"$f":"IF('Graduate Preferences'!WD4=0,\"\",'Graduate Preferences'!WD4)","v":""},{"$f":"IF('Graduate Preferences'!WE4=0,\"\",'Graduate Preferences'!WE4)","v":""},{"$f":"IF('Graduate Preferences'!WF4=0,\"\",'Graduate Preferences'!WF4)","v":""},{"$f":"IF('Graduate Preferences'!WG4=0,\"\",'Graduate Preferences'!WG4)","v":""},{"$f":"IF('Graduate Preferences'!WH4=0,\"\",'Graduate Preferences'!WH4)","v":""},{"$f":"IF('Graduate Preferences'!WI4=0,\"\",'Graduate Preferences'!WI4)","v":""},{"$f":"IF('Graduate Preferences'!WJ4=0,\"\",'Graduate Preferences'!WJ4)","v":""},{"$f":"IF('Graduate Preferences'!WK4=0,\"\",'Graduate Preferences'!WK4)","v":""},{"$f":"IF('Graduate Preferences'!WL4=0,\"\",'Graduate Preferences'!WL4)","v":""},{"$f":"IF('Graduate Preferences'!WM4=0,\"\",'Graduate Preferences'!WM4)","v":""},{"$f":"IF('Graduate Preferences'!WN4=0,\"\",'Graduate Preferences'!WN4)","v":""},{"$f":"IF('Graduate Preferences'!WO4=0,\"\",'Graduate Preferences'!WO4)","v":""},{"$f":"IF('Graduate Preferences'!WP4=0,\"\",'Graduate Preferences'!WP4)","v":""},{"$f":"IF('Graduate Preferences'!WQ4=0,\"\",'Graduate Preferences'!WQ4)","v":""},{"$f":"IF('Graduate Preferences'!WR4=0,\"\",'Graduate Preferences'!WR4)","v":""},{"$f":"IF('Graduate Preferences'!WS4=0,\"\",'Graduate Preferences'!WS4)","v":""},{"$f":"IF('Graduate Preferences'!WT4=0,\"\",'Graduate Preferences'!WT4)","v":""},{"$f":"IF('Graduate Preferences'!WU4=0,\"\",'Graduate Preferences'!WU4)","v":""},{"$f":"IF('Graduate Preferences'!WV4=0,\"\",'Graduate Preferences'!WV4)","v":""},{"$f":"IF('Graduate Preferences'!WW4=0,\"\",'Graduate Preferences'!WW4)","v":""},{"$f":"IF('Graduate Preferences'!WX4=0,\"\",'Graduate Preferences'!WX4)","v":""},{"$f":"IF('Graduate Preferences'!WY4=0,\"\",'Graduate Preferences'!WY4)","v":""},{"$f":"IF('Graduate Preferences'!WZ4=0,\"\",'Graduate Preferences'!WZ4)","v":""},{"$f":"IF('Graduate Preferences'!XA4=0,\"\",'Graduate Preferences'!XA4)","v":""},{"$f":"IF('Graduate Preferences'!XB4=0,\"\",'Graduate Preferences'!XB4)","v":""},{"$f":"IF('Graduate Preferences'!XC4=0,\"\",'Graduate Preferences'!XC4)","v":""},{"$f":"IF('Graduate Preferences'!XD4=0,\"\",'Graduate Preferences'!XD4)","v":""},{"$f":"IF('Graduate Preferences'!XE4=0,\"\",'Graduate Preferences'!XE4)","v":""},{"$f":"IF('Graduate Preferences'!XF4=0,\"\",'Graduate Preferences'!XF4)","v":""},{"$f":"IF('Graduate Preferences'!XG4=0,\"\",'Graduate Preferences'!XG4)","v":""},{"$f":"IF('Graduate Preferences'!XH4=0,\"\",'Graduate Preferences'!XH4)","v":""},{"$f":"IF('Graduate Preferences'!XI4=0,\"\",'Graduate Preferences'!XI4)","v":""},{"$f":"IF('Graduate Preferences'!XJ4=0,\"\",'Graduate Preferences'!XJ4)","v":""},{"$f":"IF('Graduate Preferences'!XK4=0,\"\",'Graduate Preferences'!XK4)","v":""},{"$f":"IF('Graduate Preferences'!XL4=0,\"\",'Graduate Preferences'!XL4)","v":""},{"$f":"IF('Graduate Preferences'!XM4=0,\"\",'Graduate Preferences'!XM4)","v":""},{"$f":"IF('Graduate Preferences'!XN4=0,\"\",'Graduate Preferences'!XN4)","v":""},{"$f":"IF('Graduate Preferences'!XO4=0,\"\",'Graduate Preferences'!XO4)","v":""},{"$f":"IF('Graduate Preferences'!XP4=0,\"\",'Graduate Preferences'!XP4)","v":""},{"$f":"IF('Graduate Preferences'!XQ4=0,\"\",'Graduate Preferences'!XQ4)","v":""},{"$f":"IF('Graduate Preferences'!XR4=0,\"\",'Graduate Preferences'!XR4)","v":""},{"$f":"IF('Graduate Preferences'!XS4=0,\"\",'Graduate Preferences'!XS4)","v":""},{"$f":"IF('Graduate Preferences'!XT4=0,\"\",'Graduate Preferences'!XT4)","v":""},{"$f":"IF('Graduate Preferences'!XU4=0,\"\",'Graduate Preferences'!XU4)","v":""},{"$f":"IF('Graduate Preferences'!XV4=0,\"\",'Graduate Preferences'!XV4)","v":""},{"$f":"IF('Graduate Preferences'!XW4=0,\"\",'Graduate Preferences'!XW4)","v":""},{"$f":"IF('Graduate Preferences'!XX4=0,\"\",'Graduate Preferences'!XX4)","v":""},{"$f":"IF('Graduate Preferences'!XY4=0,\"\",'Graduate Preferences'!XY4)","v":""},{"$f":"IF('Graduate Preferences'!XZ4=0,\"\",'Graduate Preferences'!XZ4)","v":""},{"$f":"IF('Graduate Preferences'!YA4=0,\"\",'Graduate Preferences'!YA4)","v":""},{"$f":"IF('Graduate Preferences'!YB4=0,\"\",'Graduate Preferences'!YB4)","v":""},{"$f":"IF('Graduate Preferences'!YC4=0,\"\",'Graduate Preferences'!YC4)","v":""},{"$f":"IF('Graduate Preferences'!YD4=0,\"\",'Graduate Preferences'!YD4)","v":""},{"$f":"IF('Graduate Preferences'!YE4=0,\"\",'Graduate Preferences'!YE4)","v":""},{"$f":"IF('Graduate Preferences'!YF4=0,\"\",'Graduate Preferences'!YF4)","v":""},{"$f":"IF('Graduate Preferences'!YG4=0,\"\",'Graduate Preferences'!YG4)","v":""},{"$f":"IF('Graduate Preferences'!YH4=0,\"\",'Graduate Preferences'!YH4)","v":""},{"$f":"IF('Graduate Preferences'!YI4=0,\"\",'Graduate Preferences'!YI4)","v":""},{"$f":"IF('Graduate Preferences'!YJ4=0,\"\",'Graduate Preferences'!YJ4)","v":""},{"$f":"IF('Graduate Preferences'!YK4=0,\"\",'Graduate Preferences'!YK4)","v":""}]
["Capacities",6,3,3,1,5,6,4,null,null,null,null,null,null,null,null,null,null,null,null,1,1]
[{"$f":"IF('Graduate Preferences'!A5=0,\"\",'Graduate Preferences'!A5)","v":"Alvin"},5,7,22,4,25,5,19,null,null,null,null,null,null,null,null,null,null,null,null,6,12]
[{"$f":"IF('Graduate Preferences'!A6=0,\"\",'Graduate Preferences'!A6)","v":"Bob"},14,10,23,6,19,26,5]
[{"$f":"IF('Graduate Preferences'!A7=0,\"\",'Graduate Preferences'!A7)","v":"Chelsea"},22,5,25,8,17,3,3,null,null,null,null,null,null,null,null,null,null,null,null,7,11]
[{"$f":"IF('Graduate Preferences'!A8=0,\"\",'Graduate Preferences'!A8)","v":"Daniel"},26,26,10,14,5,1,9]
[{"$f":"IF('Graduate Preferences'!A9=0,\"\",'Graduate Preferences'!A9)","v":"Emily"},3,19,15,17,18,15,8,null,null,null,null,null,null,null,null,null,null,null,null,5]
[{"$f":"IF('Graduate Preferences'!A10=0,\"\",'Graduate Preferences'!A10)","v":"Frank"},21,20,26,26,16,19,6,null,null,null,null,null,null,null,null,null,null,null,null,null,13]
[{"$f":"IF('Graduate Preferences'!A11=0,\"\",'Graduate Preferences'!A11)","v":"Geraldine"},23,14,6,25,4,18,11]
[{"$f":"IF('Graduate Preferences'!A12=0,\"\",'Graduate Preferences'!A12)","v":"Haley"},8,23,24,5,15,22,2,null,null,null,null,null,null,null,null,null,null,null,null,4]
[{"$f":"IF('Graduate Preferences'!A13=0,\"\",'Graduate Preferences'!A13)","v":"Ian"},25,4,13,15,26,8,14,null,null,null,null,null,null,null,null,null,null,null,null,null,14]
[{"$f":"IF('Graduate Preferences'!A14=0,\"\",'Graduate Preferences'!A14)","v":"Jeffrey"},24,18,8,18,14,24,22]
[{"$f":"IF('Graduate Preferences'!A15=0,\"\",'Graduate Preferences'!A15)","v":"Kevin"},20,22,4,23,10,14,7,null,null,null,null,null,null,null,null,null,null,null,null,null,3]
[{"$f":"IF('Graduate Preferences'!A16=0,\"\",'Graduate Preferences'!A16)","v":"Leia"},18,24,14,21,2,16,21]
[{"$f":"IF('Graduate Preferences'!A17=0,\"\",'Graduate Preferences'!A17)","v":"Macey"},7,17,19,13,23,4,10,null,null,null,null,null,null,null,null,null,null,null,null,8,15]
[{"$f":"IF('Graduate Preferences'!A18=0,\"\",'Graduate Preferences'!A18)","v":"Natalie"},16,15,18,3,9,17,18]
[{"$f":"IF('Graduate Preferences'!A19=0,\"\",'Graduate Preferences'!A19)","v":"Oliver"},11,25,20,22,22,7,15,null,null,null,null,null,null,null,null,null,null,null,null,null,2]
[{"$f":"IF('Graduate Preferences'!A20=0,\"\",'Graduate Preferences'!A20)","v":"Phoebe"},10,16,12,10,20,9,13,null,null,null,null,null,null,null,null,null,null,null,null,3]
[{"$f":"IF('Graduate Preferences'!A21=0,\"\",'Graduate Preferences'!A21)","v":"Quentin"},19,6,9,24,3,10,16,null,null,null,null,null,null,null,null,null,null,null,null,null,1]
[{"$f":"IF('Graduate Preferences'!A22=0,\"\",'Graduate Preferences'!A22)","v":"Rachael"},4,12,3,19,24,21,17,null,null,null,null,null,null,null,null,null,null,null,null,null,16]
[{"$f":"IF('Graduate Preferences'!A23=0,\"\",'Graduate Preferences'!A23)","v":"Stuart"},2,11,17,16,11,6,1,null,null,null,null,null,null,null,null,null,null,null,null,16]
[{"$f":"IF('Graduate Preferences'!A24=0,\"\",'Graduate Preferences'!A24)","v":"Theodore"},13,9,16,1,1,23,12]
[{"$f":"IF('Graduate Preferences'!A25=0,\"\",'Graduate Preferences'!A25)","v":"Ursula"},1,8,21,12,13,13,26,null,null,null,null,null,null,null,null,null,null,null,null,null,4]
[{"$f":"IF('Graduate Preferences'!A26=0,\"\",'Graduate Preferences'!A26)","v":"Victor"},6,21,1,7,21,11,23,null,null,null,null,null,null,null,null,null,null,null,null,9,6]
[{"$f":"IF('Graduate Preferences'!A27=0,\"\",'Graduate Preferences'!A27)","v":"Wendy"},15,2,11,11,6,12,25,null,null,null,null,null,null,null,null,null,null,null,null,null,5]
[{"$f":"IF('Graduate Preferences'!A28=0,\"\",'Graduate Preferences'!A28)","v":"Xavier"},12,13,7,2,7,25,20,null,null,null,null,null,null,null,null,null,null,null,null,10]
[{"$f":"IF('Graduate Preferences'!A29=0,\"\",'Graduate Preferences'!A29)","v":"Yasmin"},9,3,2,9,12,2,4]
[{"$f":"IF('Graduate Preferences'!A30=0,\"\",'Graduate Preferences'!A30)","v":"Zelda"},17,1,5,20,8,20,24,null,null,null,null,null,null,null,null,null,null,null,null,11,7]
[{"$f":"IF('Graduate Preferences'!A31=0,\"\",'Graduate Preferences'!A31)","v":""},null,null,null,null,null,null,null,null,null,null,null,null,null,null,null,null,null,null,null,15]
[{"$f":"IF('Graduate Preferences'!A32=0,\"\",'Graduate Preferences'!A32)","v":""},null,null,null,null,null,null,null,null,null,null,null,null,null,null,null,null,null,null,null,null,18]
[{"$f":"IF('Graduate Preferences'!A33=0,\"\",'Graduate Preferences'!A33)","v":""},null,null,null,null,null,null,null,null,null,null,null,null,null,null,null,null,null,null,null,14]
[{"$f":"IF('Graduate Preferences'!A34=0,\"\",'Graduate Preferences'!A34)","v":""},null,null,null,null,null,null,null,null,null,null,null,null,null,null,null,null,null,null,null,null,9]
[{"$f":"IF('Graduate Preferences'!A35=0,\"\",'Graduate Preferences'!A35)","v":""}]
[{"$f":"IF('Graduate Preferences'!A36=0,\"\",'Graduate Preferences'!A36)","v":""},null,null,null,null,null,null,null,null,null,null,null,null,null,null,null,null,null,null,null,12,8]
[{"$f":"IF('Graduate Preferences'!A37=0,\"\",'Graduate Preferences'!A37)","v":""},null,null,null,null,null,null,null,null,null,null,null,null,null,null,null,null,null,null,null,1]
[{"$f":"IF('Graduate Preferences'!A38=0,\"\",'Graduate Preferences'!A38)","v":""},null,null,null,null,null,null,null,null,null,null,null,null,null,null,null,null,null,null,null,13,10]
[{"$f":"IF('Graduate Preferences'!A39=0,\"\",'Graduate Preferences'!A39)","v":""},null,null,null,null,null,null,null,null,null,null,null,null,null,null,null,null,null,null,null,2]
[{"$f":"IF('Graduate Preferences'!A40=0,\"\",'Graduate Preferences'!A40)","v":""},null,null,null,null,null,null,null,null,null,null,null,null,null,null,null,null,null,null,null,null,17]
[{"$f":"IF('Graduate Preferences'!A41=0,\"\",'Graduate Preferences'!A41)","v":""}]
[{"$f":"IF('Graduate Preferences'!A42=0,\"\",'Graduate Preferences'!A42)","v":""}]
[{"$f":"IF('Graduate Preferences'!A43=0,\"\",'Graduate Preferences'!A43)","v":""}]
[{"$f":"IF('Graduate Preferences'!A44=0,\"\",'Graduate Preferences'!A44)","v":""}]
[{"$f":"IF('Graduate Preferences'!A45=0,\"\",'Graduate Preferences'!A45)","v":""}]
[{"$f":"IF('Graduate Preferences'!A46=0,\"\",'Graduate Preferences'!A46)","v":""}]
[{"$f":"IF('Graduate Preferences'!A47=0,\"\",'Graduate Preferences'!A47)","v":""}]
[{"$f":"IF('Graduate Preferences'!A48=0,\"\",'Graduate Preferences'!A48)","v":""}]
[{"$f":"IF('Graduate Preferences'!A49=0,\"\",'Graduate Preferences'!A49)","v":""}]
[{"$f":"IF('Graduate Preferences'!A50=0,\"\",'Graduate Preferences'!A50)","v":""}]
[{"$f":"IF('Graduate Preferences'!A51=0,\"\",'Graduate Preferences'!A51)","v":""}]
[{"$f":"IF('Graduate Preferences'!A52=0,\"\",'Graduate Preferences'!A52)","v":""}]
[{"$f":"IF('Graduate Preferences'!A53=0,\"\",'Graduate Preferences'!A53)","v":""}]
[{"$f":"IF('Graduate Preferences'!A54=0,\"\",'Graduate Preferences'!A54)","v":""}]
[{"$f":"IF('Graduate Preferences'!A55=0,\"\",'Graduate Preferences'!A55)","v":""}]
[{"$f":"IF('Graduate Preferences'!A56=0,\"\",'Graduate Preferences'!A56)","v":""}]
[{"$f":"IF('Graduate Preferences'!A57=0,\"\",'Graduate Preferences'!A57)","v":""}]
[{"$f":"IF('Graduate Preferences'!A58=0,\"\",'Graduate Preferences'!A58)","v":""}]
[{"$f":"IF('Graduate Preferences'!A59=0,\"\",'Graduate Preferences'!A59)","v":""}]
[{"$f":"IF('Graduate Preferences'!A60=0,\"\",'Graduate Preferences'!A60)","v":""}]
[{"$f":"IF('Graduate Preferences'!A61=0,\"\",'Graduate Preferences'!A61)","v":""}]
[{"$f":"IF('Graduate Preferences'!A62=0,\"\",'Graduate Preferences'!A62)","v":""}]
[{"$f":"IF('Graduate Preferences'!A63=0,\"\",'Graduate Preferences'!A63)","v":""}]
[{"$f":"IF('Graduate Preferences'!A64=0,\"\",'Graduate Preferences'!A64)","v":""}]
[{"$f":"IF('Graduate Preferences'!A65=0,\"\",'Graduate Preferences'!A65)","v":""}]
[{"$f":"IF('Graduate Preferences'!A66=0,\"\",'Graduate Preferences'!A66)","v":""}]
[{"$f":"IF('Graduate Preferences'!A67=0,\"\",'Graduate Preferences'!A67)","v":""}]
[{"$f":"IF('Graduate Preferences'!A68=0,\"\",'Graduate Preferences'!A68)","v":""}]
[{"$f":"IF('Graduate Preferences'!A69=0,\"\",'Graduate Preferences'!A69)","v":""}]
[{"$f":"IF('Graduate Preferences'!A70=0,\"\",'Graduate Preferences'!A70)","v":""}]
[{"$f":"IF('Graduate Preferences'!A71=0,\"\",'Graduate Preferences'!A71)","v":""}]
[{"$f":"IF('Graduate Preferences'!A72=0,\"\",'Graduate Preferences'!A72)","v":""}]
[{"$f":"IF('Graduate Preferences'!A73=0,\"\",'Graduate Preferences'!A73)","v":""}]
[{"$f":"IF('Graduate Preferences'!A74=0,\"\",'Graduate Preferences'!A74)","v":""}]
[{"$f":"IF('Graduate Preferences'!A75=0,\"\",'Graduate Preferences'!A75)","v":""}]
[{"$f":"IF('Graduate Preferences'!A76=0,\"\",'Graduate Preferences'!A76)","v":""}]
[{"$f":"IF('Graduate Preferences'!A77=0,\"\",'Graduate Preferences'!A77)","v":""}]
[{"$f":"IF('Graduate Preferences'!A78=0,\"\",'Graduate Preferences'!A78)","v":""}]
[{"$f":"IF('Graduate Preferences'!A79=0,\"\",'Graduate Preferences'!A79)","v":""}]
[{"$f":"IF('Graduate Preferences'!A80=0,\"\",'Graduate Preferences'!A80)","v":""}]
[{"$f":"IF('Graduate Preferences'!A81=0,\"\",'Graduate Preferences'!A81)","v":""}]
[{"$f":"IF('Graduate Preferences'!A82=0,\"\",'Graduate Preferences'!A82)","v":""}]
[{"$f":"IF('Graduate Preferences'!A83=0,\"\",'Graduate Preferences'!A83)","v":""}]
[{"$f":"IF('Graduate Preferences'!A84=0,\"\",'Graduate Preferences'!A84)","v":""}]
[{"$f":"IF('Graduate Preferences'!A85=0,\"\",'Graduate Preferences'!A85)","v":""}]
[{"$f":"IF('Graduate Preferences'!A86=0,\"\",'Graduate Preferences'!A86)","v":""}]
[{"$f":"IF('Graduate Preferences'!A87=0,\"\",'Graduate Preferences'!A87)","v":""}]
[{"$f":"IF('Graduate Preferences'!A88=0,\"\",'Graduate Preferences'!A88)","v":""}]
[{"$f":"IF('Graduate Preferences'!A89=0,\"\",'Graduate Preferences'!A89)","v":""}]
[{"$f":"IF('Graduate Preferences'!A90=0,\"\",'Graduate Preferences'!A90)","v":""}]
[{"$f":"IF('Graduate Preferences'!A91=0,\"\",'Graduate Preferences'!A91)","v":""}]
[{"$f":"IF('Graduate Preferences'!A92=0,\"\",'Graduate Preferences'!A92)","v":""}]
[{"$f":"IF('Graduate Preferences'!A93=0,\"\",'Graduate Preferences'!A93)","v":""}]
[{"$f":"IF('Graduate Preferences'!A94=0,\"\",'Graduate Preferences'!A94)","v":""}]
[{"$f":"IF('Graduate Preferences'!A95=0,\"\",'Graduate Preferences'!A95)","v":""}]
[{"$f":"IF('Graduate Preferences'!A96=0,\"\",'Graduate Preferences'!A96)","v":""}]
[{"$f":"IF('Graduate Preferences'!A97=0,\"\",'Graduate Preferences'!A97)","v":""}]
[{"$f":"IF('Graduate Preferences'!A98=0,\"\",'Graduate Preferences'!A98)","v":""}]
[{"$f":"IF('Graduate Preferences'!A99=0,\"\",'Graduate Preferences'!A99)","v":""}]
[{"$f":"IF('Graduate Preferences'!A100=0,\"\",'Graduate Preferences'!A100)","v":""}]
[{"$f":"IF('Graduate Preferences'!A101=0,\"\",'Graduate Preferences'!A101)","v":""}]
[{"$f":"IF('Graduate Preferences'!A102=0,\"\",'Graduate Preferences'!A102)","v":""}]
[{"$f":"IF('Graduate Preferences'!A103=0,\"\",'Graduate Preferences'!A103)","v":""}]
[{"$f":"IF('Graduate Preferences'!A104=0,\"\",'Graduate Preferences'!A104)","v":""}]
[{"$f":"IF('Graduate Preferences'!A105=0,\"\",'Graduate Preferences'!A105)","v":""}]
[{"$f":"IF('Graduate Preferences'!A106=0,\"\",'Graduate Preferences'!A106)","v":""}]
[{"$f":"IF('Graduate Preferences'!A107=0,\"\",'Graduate Preferences'!A107)","v":""}]
[{"$f":"IF('Graduate Preferences'!A108=0,\"\",'Graduate Preferences'!A108)","v":""}]
[{"$f":"IF('Graduate Preferences'!A109=0,\"\",'Graduate Preferences'!A109)","v":""}]
[{"$f":"IF('Graduate Preferences'!A110=0,\"\",'Graduate Preferences'!A110)","v":""}]
[{"$f":"IF('Graduate Preferences'!A111=0,\"\",'Graduate Preferences'!A111)","v":""}]
[{"$f":"IF('Graduate Preferences'!A112=0,\"\",'Graduate Preferences'!A112)","v":""}]
[{"$f":"IF('Graduate Preferences'!A113=0,\"\",'Graduate Preferences'!A113)","v":""}]
[{"$f":"IF('Graduate Preferences'!A114=0,\"\",'Graduate Preferences'!A114)","v":""}]
[{"$f":"IF('Graduate Preferences'!A115=0,\"\",'Graduate Preferences'!A115)","v":""}]
[{"$f":"IF('Graduate Preferences'!A116=0,\"\",'Graduate Preferences'!A116)","v":""}]
[{"$f":"IF('Graduate Preferences'!A117=0,\"\",'Graduate Preferences'!A117)","v":""}]
[{"$f":"IF('Graduate Preferences'!A118=0,\"\",'Graduate Preferences'!A118)","v":""}]
[{"$f":"IF('Graduate Preferences'!A119=0,\"\",'Graduate Preferences'!A119)","v":""}]
[{"$f":"IF('Graduate Preferences'!A120=0,\"\",'Graduate Preferences'!A120)","v":""}]
[{"$f":"IF('Graduate Preferences'!A121=0,\"\",'Graduate Preferences'!A121)","v":""}]
[{"$f":"IF('Graduate Preferences'!A122=0,\"\",'Graduate Preferences'!A122)","v":""}]
[{"$f":"IF('Graduate Preferences'!A123=0,\"\",'Graduate Preferences'!A123)","v":""}]
[{"$f":"IF('Graduate Preferences'!A124=0,\"\",'Graduate Preferences'!A124)","v":""}]
[{"$f":"IF('Graduate Preferences'!A125=0,\"\",'Graduate Preferences'!A125)","v":""}]
[{"$f":"IF('Graduate Preferences'!A126=0,\"\",'Graduate Preferences'!A126)","v":""}]
[{"$f":"IF('Graduate Preferences'!A127=0,\"\",'Graduate Preferences'!A127)","v":""}]
[{"$f":"IF('Graduate Preferences'!A128=0,\"\",'Graduate Preferences'!A128)","v":""}]
[{"$f":"IF('Graduate Preferences'!A129=0,\"\",'Graduate Preferences'!A129)","v":""}]
[{"$f":"IF('Graduate Preferences'!A130=0,\"\",'Graduate Preferences'!A130)","v":""}]
[{"$f":"IF('Graduate Preferences'!A131=0,\"\",'Graduate Preferences'!A131)","v":""}]
[{"$f":"IF('Graduate Preferences'!A132=0,\"\",'Graduate Preferences'!A132)","v":""}]
[{"$f":"IF('Graduate Preferences'!A133=0,\"\",'Graduate Preferences'!A133)","v":""}]
[{"$f":"IF('Graduate Preferences'!A134=0,\"\",'Graduate Preferences'!A134)","v":""}]
[{"$f":"IF('Graduate Preferences'!A135=0,\"\",'Graduate Preferences'!A135)","v":""}]
[{"$f":"IF('Graduate Preferences'!A136=0,\"\",'Graduate Preferences'!A136)","v":""}]
[{"$f":"IF('Graduate Preferences'!A137=0,\"\",'Graduate Preferences'!A137)","v":""}]
[{"$f":"IF('Graduate Preferences'!A138=0,\"\",'Graduate Preferences'!A138)","v":""}]
[{"$f":"IF('Graduate Preferences'!A139=0,\"\",'Graduate Preferences'!A139)","v":""}]
[{"$f":"IF('Graduate Preferences'!A140=0,\"\",'Graduate Preferences'!A140)","v":""}]
[{"$f":"IF('Graduate Preferences'!A141=0,\"\",'Graduate Preferences'!A141)","v":""}]
[{"$f":"IF('Graduate Preferences'!A142=0,\"\",'Graduate Preferences'!A142)","v":""}]
[{"$f":"IF('Graduate Preferences'!A143=0,\"\",'Graduate Preferences'!A143)","v":""}]
[{"$f":"IF('Graduate Preferences'!A144=0,\"\",'Graduate Preferences'!A144)","v":""}]
[{"$f":"IF('Graduate Preferences'!A145=0,\"\",'Graduate Preferences'!A145)","v":""}]
[{"$f":"IF('Graduate Preferences'!A146=0,\"\",'Graduate Preferences'!A146)","v":""}]
[{"$f":"IF('Graduate Preferences'!A147=0,\"\",'Graduate Preferences'!A147)","v":""}]
[{"$f":"IF('Graduate Preferences'!A148=0,\"\",'Graduate Preferences'!A148)","v":""}]
[{"$f":"IF('Graduate Preferences'!A149=0,\"\",'Graduate Preferences'!A149)","v":""}]
[{"$f":"IF('Graduate Preferences'!A150=0,\"\",'Graduate Preferences'!A150)","v":""}]
[{"$f":"IF('Graduate Preferences'!A151=0,\"\",'Graduate Preferences'!A151)","v":""}]
[{"$f":"IF('Graduate Preferences'!A152=0,\"\",'Graduate Preferences'!A152)","v":""}]
[{"$f":"IF('Graduate Preferences'!A153=0,\"\",'Graduate Preferences'!A153)","v":""}]
[{"$f":"IF('Graduate Preferences'!A154=0,\"\",'Graduate Preferences'!A154)","v":""}]
[{"$f":"IF('Graduate Preferences'!A155=0,\"\",'Graduate Preferences'!A155)","v":""}]
[{"$f":"IF('Graduate Preferences'!A156=0,\"\",'Graduate Preferences'!A156)","v":""}]
[{"$f":"IF('Graduate Preferences'!A157=0,\"\",'Graduate Preferences'!A157)","v":""}]
[{"$f":"IF('Graduate Preferences'!A158=0,\"\",'Graduate Preferences'!A158)","v":""}]
[{"$f":"IF('Graduate Preferences'!A159=0,\"\",'Graduate Preferences'!A159)","v":""}]
[{"$f":"IF('Graduate Preferences'!A160=0,\"\",'Graduate Preferences'!A160)","v":""}]
[{"$f":"IF('Graduate Preferences'!A161=0,\"\",'Graduate Preferences'!A161)","v":""}]
[{"$f":"IF('Graduate Preferences'!A162=0,\"\",'Graduate Preferences'!A162)","v":""}]
[{"$f":"IF('Graduate Preferences'!A163=0,\"\",'Graduate Preferences'!A163)","v":""}]
[{"$f":"IF('Graduate Preferences'!A164=0,\"\",'Graduate Preferences'!A164)","v":""}]
[{"$f":"IF('Graduate Preferences'!A165=0,\"\",'Graduate Preferences'!A165)","v":""}]
[{"$f":"IF('Graduate Preferences'!A166=0,\"\",'Graduate Preferences'!A166)","v":""}]
[{"$f":"IF('Graduate Preferences'!A167=0,\"\",'Graduate Preferences'!A167)","v":""}]
[{"$f":"IF('Graduate Preferences'!A168=0,\"\",'Graduate Preferences'!A168)","v":""}]
[{"$f":"IF('Graduate Preferences'!A169=0,\"\",'Graduate Preferences'!A169)","v":""}]
[{"$f":"IF('Graduate Preferences'!A170=0,\"\",'Graduate Preferences'!A170)","v":""}]
[{"$f":"IF('Graduate Preferences'!A171=0,\"\",'Graduate Preferences'!A171)","v":""}]
[{"$f":"IF('Graduate Preferences'!A172=0,\"\",'Graduate Preferences'!A172)","v":""}]
[{"$f":"IF('Graduate Preferences'!A173=0,\"\",'Graduate Preferences'!A173)","v":""}]
[{"$f":"IF('Graduate Preferences'!A174=0,\"\",'Graduate Preferences'!A174)","v":""}]
[{"$f":"IF('Graduate Preferences'!A175=0,\"\",'Graduate Preferences'!A175)","v":""}]
[{"$f":"IF('Graduate Preferences'!A176=0,\"\",'Graduate Preferences'!A176)","v":""}]
[{"$f":"IF('Graduate Preferences'!A177=0,\"\",'Graduate Preferences'!A177)","v":""}]
[{"$f":"IF('Graduate Preferences'!A178=0,\"\",'Graduate Preferences'!A178)","v":""}]
[{"$f":"IF('Graduate Preferences'!A179=0,\"\",'Graduate Preferences'!A179)","v":""}]
[{"$f":"IF('Graduate Preferences'!A180=0,\"\",'Graduate Preferences'!A180)","v":""}]
[{"$f":"IF('Graduate Preferences'!A181=0,\"\",'Graduate Preferences'!A181)","v":""}]
[{"$f":"IF('Graduate Preferences'!A182=0,\"\",'Graduate Preferences'!A182)","v":""}]
[{"$f":"IF('Graduate Preferences'!A183=0,\"\",'Graduate Preferences'!A183)","v":""}]
[{"$f":"IF('Graduate Preferences'!A184=0,\"\",'Graduate Preferences'!A184)","v":""}]
[{"$f":"IF('Graduate Preferences'!A185=0,\"\",'Graduate Preferences'!A185)","v":""}]
[{"$f":"IF('Graduate Preferences'!A186=0,\"\",'Graduate Preferences'!A186)","v":""}]
[{"$f":"IF('Graduate Preferences'!A187=0,\"\",'Graduate Preferences'!A187)","v":""}]
[{"$f":"IF('Graduate Preferences'!A188=0,\"\",'Graduate Preferences'!A188)","v":""}]
[{"$f":"IF('Graduate Preferences'!A189=0,\"\",'Graduate Preferences'!A189)","v":""}]
[{"$f":"IF('Graduate Preferences'!A190=0,\"\",'Graduate Preferences'!A190)","v":""}]
[{"$f":"IF('Graduate Preferences'!A191=0,\"\",'Graduate Preferences'!A191)","v":""}]
[{"$f":"IF('Graduate Preferences'!A192=0,\"\",'Graduate Preferences'!A192)","v":""}]
[{"$f":"IF('Graduate Preferences'!A193=0,\"\",'Graduate Preferences'!A193)","v":""}]
[{"$f":"IF('Graduate Preferences'!A194=0,\"\",'Graduate Preferences'!A194)","v":""}]
[{"$f":"IF('Graduate Preferences'!A195=0,\"\",'Graduate Preferences'!A195)","v":""}]
[{"$f":"IF('Graduate Preferences'!A196=0,\"\",'Graduate Preferences'!A196)","v":""}]
[{"$f":"IF('Graduate Preferences'!A197=0,\"\",'Graduate Preferences'!A197)","v":""}]
[{"$f":"IF('Graduate Preferences'!A198=0,\"\",'Graduate Preferences'!A198)","v":""}]
[{"$f":"IF('Graduate Preferences'!A199=0,\"\",'Graduate Preferences'!A199)","v":""}]
[{"$f":"IF('Graduate Preferences'!A200=0,\"\",'Graduate Preferences'!A200)","v":""}]
[{"$f":"IF('Graduate Preferences'!A201=0,\"\",'Graduate Preferences'!A201)","v":""}]
[{"$f":"IF('Graduate Preferences'!A202=0,\"\",'Graduate Preferences'!A202)","v":""}]
[{"$f":"IF('Graduate Preferences'!A203=0,\"\",'Graduate Preferences'!A203)","v":""}]
[{"$f":"IF('Graduate Preferences'!A204=0,\"\",'Graduate Preferences'!A204)","v":""}]
[{"$f":"IF('Graduate Preferences'!A205=0,\"\",'Graduate Preferences'!A205)","v":""}]
[{"$f":"IF('Graduate Preferences'!A206=0,\"\",'Graduate Preferences'!A206)","v":""}]
[{"$f":"IF('Graduate Preferences'!A207=0,\"\",'Graduate Preferences'!A207)","v":""}]
[{"$f":"IF('Graduate Preferences'!A208=0,\"\",'Graduate Preferences'!A208)","v":""}]
[{"$f":"IF('Graduate Preferences'!A209=0,\"\",'Graduate Preferences'!A209)","v":""}]
[{"$f":"IF('Graduate Preferences'!A210=0,\"\",'Graduate Preferences'!A210)","v":""}]
[{"$f":"IF('Graduate Preferences'!A211=0,\"\",'Graduate Preferences'!A211)","v":""}]
[{"$f":"IF('Graduate Preferences'!A212=0,\"\",'Graduate Preferences'!A212)","v":""}]
[{"$f":"IF('Graduate Preferences'!A213=0,\"\",'Graduate Preferences'!A213)","v":""}]
[{"$f":"IF('Graduate Preferences'!A214=0,\"\",'Graduate Preferences'!A214)","v":""}]
[{"$f":"IF('Graduate Preferences'!A215=0,\"\",'Graduate Preferences'!A215)","v":""}]
[{"$f":"IF('Graduate Preferences'!A216=0,\"\",'Graduate Preferences'!A216)","v":""}]
[{"$f":"IF('Graduate Preferences'!A217=0,\"\",'Graduate Preferences'!A217)","v":""}]
[{"$f":"IF('Graduate Preferences'!A218=0,\"\",'Graduate Preferences'!A218)","v":""}]
[{"$f":"IF('Graduate Preferences'!A219=0,\"\",'Graduate Preferences'!A219)","v":""}]
[{"$f":"IF('Graduate Preferences'!A220=0,\"\",'Graduate Preferences'!A220)","v":""}]
[{"$f":"IF('Graduate Preferences'!A221=0,\"\",'Graduate Preferences'!A221)","v":""}]
[{"$f":"IF('Graduate Preferences'!A222=0,\"\",'Graduate Preferences'!A222)","v":""}]
[{"$f":"IF('Graduate Preferences'!A223=0,\"\",'Graduate Preferences'!A223)","v":""}]
[{"$f":"IF('Graduate Preferences'!A224=0,\"\",'Graduate Preferences'!A224)","v":""}]
[{"$f":"IF('Graduate Preferences'!A225=0,\"\",'Graduate Preferences'!A225)","v":""}]
[{"$f":"IF('Graduate Preferences'!A226=0,\"\",'Graduate Preferences'!A226)","v":""}]
[{"$f":"IF('Graduate Preferences'!A227=0,\"\",'Graduate Preferences'!A227)","v":""}]
[{"$f":"IF('Graduate Preferences'!A228=0,\"\",'Graduate Preferences'!A228)","v":""}]
[{"$f":"IF('Graduate Preferences'!A229=0,\"\",'Graduate Preferences'!A229)","v":""}]
[{"$f":"IF('Graduate Preferences'!A230=0,\"\",'Graduate Preferences'!A230)","v":""}]
[{"$f":"IF('Graduate Preferences'!A231=0,\"\",'Graduate Preferences'!A231)","v":""}]
[{"$f":"IF('Graduate Preferences'!A232=0,\"\",'Graduate Preferences'!A232)","v":""}]
[{"$f":"IF('Graduate Preferences'!A233=0,\"\",'Graduate Preferences'!A233)","v":""}]
[{"$f":"IF('Graduate Preferences'!A234=0,\"\",'Graduate Preferences'!A234)","v":""}]
[{"$f":"IF('Graduate Preferences'!A235=0,\"\",'Graduate Preferences'!A235)","v":""}]
[{"$f":"IF('Graduate Preferences'!A236=0,\"\",'Graduate Preferences'!A236)","v":""}]
[{"$f":"IF('Graduate Preferences'!A237=0,\"\",'Graduate Preferences'!A237)","v":""}]
[{"$f":"IF('Graduate Preferences'!A238=0,\"\",'Graduate Preferences'!A238)","v":""}]
[{"$f":"IF('Graduate Preferences'!A239=0,\"\",'Graduate Preferences'!A239)","v":""}]
[{"$f":"IF('Graduate Preferences'!A240=0,\"\",'Graduate Preferences'!A240)","v":""}]
[{"$f":"IF('Graduate Preferences'!A241=0,\"\",'Graduate Preferences'!A241)","v":""}]
[{"$f":"IF('Graduate Preferences'!A242=0,\"\",'Graduate Preferences'!A242)","v":""}]
[{"$f":"IF('Graduate Preferences'!A243=0,\"\",'Graduate Preferences'!A243)","v":""}]
[{"$f":"IF('Graduate Preferences'!A244=0,\"\",'Graduate Preferences'!A244)","v":""}]
[{"$f":"IF('Graduate Preferences'!A245=0,\"\",'Graduate Preferences'!A245)","v":""}]
[{"$f":"IF('Graduate Preferences'!A246=0,\"\",'Graduate Preferences'!A246)","v":""}]
[{"$f":"IF('Graduate Preferences'!A247=0,\"\",'Graduate Preferences'!A247)","v":""}]
[{"$f":"IF('Graduate Preferences'!A248=0,\"\",'Graduate Preferences'!A248)","v":""}]
[{"$f":"IF('Graduate Preferences'!A249=0,\"\",'Graduate Preferences'!A249)","v":""}]
[{"$f":"IF('Graduate Preferences'!A250=0,\"\",'Graduate Preferences'!A250)","v":""}]
[{"$f":"IF('Graduate Preferences'!A251=0,\"\",'Graduate Preferences'!A251)","v":""}]
[{"$f":"IF('Graduate Preferences'!A252=0,\"\",'Graduate Preferences'!A252)","v":""}]
[{"$f":"IF('Graduate Preferences'!A253=0,\"\",'Graduate Preferences'!A253)","v":""}]
[{"$f":"IF('Graduate Preferences'!A254=0,\"\",'Graduate Preferences'!A254)","v":""}]
[{"$f":"IF('Graduate Preferences'!A255=0,\"\",'Graduate Preferences'!A255)","v":""}]
[{"$f":"IF('Graduate Preferences'!A256=0,\"\",'Graduate Preferences'!A256)","v":""}]
[{"$f":"IF('Graduate Preferences'!A257=0,\"\",'Graduate Preferences'!A257)","v":""}]
[{"$f":"IF('Graduate Preferences'!A258=0,\"\",'Graduate Preferences'!A258)","v":""}]
[{"$f":"IF('Graduate Preferences'!A259=0,\"\",'Graduate Preferences'!A259)","v":""}]
[{"$f":"IF('Graduate Preferences'!A260=0,\"\",'Graduate Preferences'!A260)","v":""}]
[{"$f":"IF('Graduate Preferences'!A261=0,\"\",'Graduate Preferences'!A261)","v":""}]
[{"$f":"IF('Graduate Preferences'!A262=0,\"\",'Graduate Preferences'!A262)","v":""}]
[{"$f":"IF('Graduate Preferences'!A263=0,\"\",'Graduate Preferences'!A263)","v":""}]
[{"$f":"IF('Graduate Preferences'!A264=0,\"\",'Graduate Preferences'!A264)","v":""}]
[{"$f":"IF('Graduate Preferences'!A265=0,\"\",'Graduate Preferences'!A265)","v":""}]
[{"$f":"IF('Graduate Preferences'!A266=0,\"\",'Graduate Preferences'!A266)","v":""}]
[{"$f":"IF('Graduate Preferences'!A267=0,\"\",'Graduate Preferences'!A267)","v":""}]
[{"$f":"IF('Graduate Preferences'!A268=0,\"\",'Graduate Preferences'!A268)","v":""}]
[{"$f":"IF('Graduate Preferences'!A269=0,\"\",'Graduate Preferences'!A269)","v":""}]
[{"$f":"IF('Graduate Preferences'!A270=0,\"\",'Graduate Preferences'!A270)","v":""}]
[{"$f":"IF('Graduate Preferences'!A271=0,\"\",'Graduate Preferences'!A271)","v":""}]
[{"$f":"IF('Graduate Preferences'!A272=0,\"\",'Graduate Preferences'!A272)","v":""}]
[{"$f":"IF('Graduate Preferences'!A273=0,\"\",'Graduate Preferences'!A273)","v":""}]
[{"$f":"IF('Graduate Preferences'!A274=0,\"\",'Graduate Preferences'!A274)","v":""}]

{"sheet":"Final Matching","index":3,"n_rows":28,"n_cols":57,"rows_kept":28,"cut":false,"hidden":false,"merged":[[0,0,0,16383]]}
[]
["Graduate","Division",null,"Division","Capacity",{"$f":"IF(Work!A1<=MAX('Division Preferences'!$B$5:$ZZ$5),CONCATENATE(\"Graduate \", Work!A1),\"\")","v":"Graduate 1"},{"$f":"IF(Work!B1<=MAX('Division Preferences'!$B$5:$ZZ$5),CONCATENATE(\"Graduate \", Work!B1),\"\")","v":"Graduate 2"},{"$f":"IF(Work!C1<=MAX('Division Preferences'!$B$5:$ZZ$5),CONCATENATE(\"Graduate \", Work!C1),\"\")","v":"Graduate 3"},{"$f":"IF(Work!D1<=MAX('Division Preferences'!$B$5:$ZZ$5),CONCATENATE(\"Graduate \", Work!D1),\"\")","v":"Graduate 4"},{"$f":"IF(Work!E1<=MAX('Division Preferences'!$B$5:$ZZ$5),CONCATENATE(\"Graduate \", Work!E1),\"\")","v":"Graduate 5"},{"$f":"IF(Work!F1<=MAX('Division Preferences'!$B$5:$ZZ$5),CONCATENATE(\"Graduate \", Work!F1),\"\")","v":"Graduate 6"},{"$f":"IF(Work!G1<=MAX('Division Preferences'!$B$5:$ZZ$5),CONCATENATE(\"Graduate \", Work!G1),\"\")","v":""},{"$f":"IF(Work!H1<=MAX('Division Preferences'!$B$5:$ZZ$5),CONCATENATE(\"Graduate \", Work!H1),\"\")","v":""},{"$f":"IF(Work!I1<=MAX('Division Preferences'!$B$5:$ZZ$5),CONCATENATE(\"Graduate \", Work!I1),\"\")","v":""},{"$f":"IF(Work!J1<=MAX('Division Preferences'!$B$5:$ZZ$5),CONCATENATE(\"Graduate \", Work!J1),\"\")","v":""},{"$f":"IF(Work!K1<=MAX('Division Preferences'!$B$5:$ZZ$5),CONCATENATE(\"Graduate \", Work!K1),\"\")","v":""},{"$f":"IF(Work!L1<=MAX('Division Preferences'!$B$5:$ZZ$5),CONCATENATE(\"Graduate \", Work!L1),\"\")","v":""},{"$f":"IF(Work!M1<=MAX('Division Preferences'!$B$5:$ZZ$5),CONCATENATE(\"Graduate \", Work!M1),\"\")","v":""},{"$f":"IF(Work!N1<=MAX('Division Preferences'!$B$5:$ZZ$5),CONCATENATE(\"Graduate \", Work!N1),\"\")","v":""},{"$f":"IF(Work!O1<=MAX('Division Preferences'!$B$5:$ZZ$5),CONCATENATE(\"Graduate \", Work!O1),\"\")","v":""},{"$f":"IF(Work!P1<=MAX('Division Preferences'!$B$5:$ZZ$5),CONCATENATE(\"Graduate \", Work!P1),\"\")","v":""},{"$f":"IF(Work!Q1<=MAX('Division Preferences'!$B$5:$ZZ$5),CONCATENATE(\"Graduate \", Work!Q1),\"\")","v":""},{"$f":"IF(Work!R1<=MAX('Division Preferences'!$B$5:$ZZ$5),CONCATENATE(\"Graduate \", Work!R1),\"\")","v":""},{"$f":"IF(Work!S1<=MAX('Division Preferences'!$B$5:$ZZ$5),CONCATENATE(\"Graduate \", Work!S1),\"\")","v":""},{"$f":"IF(Work!T1<=MAX('Division Preferences'!$B$5:$ZZ$5),CONCATENATE(\"Graduate \", Work!T1),\"\")","v":""},{"$f":"IF(Work!U1<=MAX('Division Preferences'!$B$5:$ZZ$5),CONCATENATE(\"Graduate \", Work!U1),\"\")","v":""},{"$f":"IF(Work!V1<=MAX('Division Preferences'!$B$5:$ZZ$5),CONCATENATE(\"Graduate \", Work!V1),\"\")","v":""},{"$f":"IF(Work!W1<=MAX('Division Preferences'!$B$5:$ZZ$5),CONCATENATE(\"Graduate \", Work!W1),\"\")","v":""},{"$f":"IF(Work!X1<=MAX('Division Preferences'!$B$5:$ZZ$5),CONCATENATE(\"Graduate \", Work!X1),\"\")","v":""},{"$f":"IF(Work!Y1<=MAX('Division Preferences'!$B$5:$ZZ$5),CONCATENATE(\"Graduate \", Work!Y1),\"\")","v":""},{"$f":"IF(Work!Z1<=MAX('Division Preferences'!$B$5:$ZZ$5),CONCATENATE(\"Graduate \", Work!Z1),\"\")","v":""},{"$f":"IF(Work!AA1<=MAX('Division Preferences'!$B$5:$ZZ$5),CONCATENATE(\"Graduate \", Work!AA1),\"\")","v":""},{"$f":"IF(Work!AB1<=MAX('Division Preferences'!$B$5:$ZZ$5),CONCATENATE(\"Graduate \", Work!AB1),\"\")","v":""},{"$f":"IF(Work!AC1<=MAX('Division Preferences'!$B$5:$ZZ$5),CONCATENATE(\"Graduate \", Work!AC1),\"\")","v":""},{"$f":"IF(Work!AD1<=MAX('Division Preferences'!$B$5:$ZZ$5),CONCATENATE(\"Graduate \", Work!AD1),\"\")","v":""},{"$f":"IF(Work!AE1<=MAX('Division Preferences'!$B$5:$ZZ$5),CONCATENATE(\"Graduate \", Work!AE1),\"\")","v":""},{"$f":"IF(Work!AF1<=MAX('Division Preferences'!$B$5:$ZZ$5),CONCATENATE(\"Graduate \", Work!AF1),\"\")","v":""},{"$f":"IF(Work!AG1<=MAX('Division Preferences'!$B$5:$ZZ$5),CONCATENATE(\"Graduate \", Work!AG1),\"\")","v":""},{"$f":"IF(Work!AH1<=MAX('Division Preferences'!$B$5:$ZZ$5),CONCATENATE(\"Graduate \", Work!AH1),\"\")","v":""},{"$f":"IF(Work!AI1<=MAX('Division Preferences'!$B$5:$ZZ$5),CONCATENATE(\"Graduate \", Work!AI1),\"\")","v":""},{"$f":"IF(Work!AJ1<=MAX('Division Preferences'!$B$5:$ZZ$5),CONCATENATE(\"Graduate \", Work!AJ1),\"\")","v":""},{"$f":"IF(Work!AK1<=MAX('Division Preferences'!$B$5:$ZZ$5),CONCATENATE(\"Graduate \", Work!AK1),\"\")","v":""},{"$f":"IF(Work!AL1<=MAX('Division Preferences'!$B$5:$ZZ$5),CONCATENATE(\"Graduate \", Work!AL1),\"\")","v":""},{"$f":"IF(Work!AM1<=MAX('Division Preferences'!$B$5:$ZZ$5),CONCATENATE(\"Graduate \", Work!AM1),\"\")","v":""},{"$f":"IF(Work!AN1<=MAX('Division Preferences'!$B$5:$ZZ$5),CONCATENATE(\"Graduate \", Work!AN1),\"\")","v":""},{"$f":"IF(Work!AO1<=MAX('Division Preferences'!$B$5:$ZZ$5),CONCATENATE(\"Graduate \", Work!AO1),\"\")","v":""},{"$f":"IF(Work!AP1<=MAX('Division Preferences'!$B$5:$ZZ$5),CONCATENATE(\"Graduate \", Work!AP1),\"\")","v":""},{"$f":"IF(Work!AQ1<=MAX('Division Preferences'!$B$5:$ZZ$5),CONCATENATE(\"Graduate \", Work!AQ1),\"\")","v":""},{"$f":"IF(Work!AR1<=MAX('Division Preferences'!$B$5:$ZZ$5),CONCATENATE(\"Graduate \", Work!AR1),\"\")","v":""},{"$f":"IF(Work!AS1<=MAX('Division Preferences'!$B$5:$ZZ$5),CONCATENATE(\"Graduate \", Work!AS1),\"\")","v":""},{"$f":"IF(Work!AT1<=MAX('Division Preferences'!$B$5:$ZZ$5),CONCATENATE(\"Graduate \", Work!AT1),\"\")","v":""},{"$f":"IF(Work!AU1<=MAX('Division Preferences'!$B$5:$ZZ$5),CONCATENATE(\"Graduate \", Work!AU1),\"\")","v":""},{"$f":"IF(Work!AV1<=MAX('Division Preferences'!$B$5:$ZZ$5),CONCATENATE(\"Graduate \", Work!AV1),\"\")","v":""},{"$f":"IF(Work!AW1<=MAX('Division Preferences'!$B$5:$ZZ$5),CONCATENATE(\"Graduate \", Work!AW1),\"\")","v":""},{"$f":"IF(Work!AX1<=MAX('Division Preferences'!$B$5:$ZZ$5),CONCATENATE(\"Graduate \", Work!AX1),\"\")","v":""},{"$f":"IF(Work!AZ1<=MAX('Division Preferences'!$B$5:$ZZ$5),CONCATENATE(\"Graduate \", Work!AZ1),\"\")","v":""},{"$f":"IF(Work!BA1<=MAX('Division Preferences'!$B$5:$ZZ$5),CONCATENATE(\"Graduate \", Work!BA1),\"\")","v":""}]
["Alvin","Finance",null,"Finance",6,"Stuart","Rachael","Alvin","Yasmin","Chelsea","Jeffrey"]
["Bob","Jedi",null,"Marketing",3,"Ian","Quentin","Ursula"]
["Chelsea","Finance",null,"Law",3,"Victor","Xavier","Haley"]
["Daniel","Economics",null,"Jedi",1,"Bob"]
["Emily","Economics",null,"Economics",5,"Theodore","Daniel","Wendy","Kevin","Emily"]
["Frank","Research",null,"Budget",6,"Macey","Oliver","Natalie","Zelda"]
["Geraldine","Research",null,"Research",4,"Frank","Geraldine","Phoebe","Leia"]
["Haley","Law"]
["Ian","Marketing"]
["Jeffrey","Finance"]
["Kevin","Economics"]
["Leia","Research"]
["Macey","Budget"]
["Natalie","Budget"]
["Oliver","Budget"]
["Phoebe","Research"]
["Quentin","Marketing"]
["Rachael","Finance"]
["Stuart","Finance"]
["Theodore","Economics"]
["Ursula","Marketing"]
["Victor","Law"]
["Wendy","Economics"]
["Xavier","Law"]
["Yasmin","Finance"]
["Zelda","Budget"]

{"sheet":"Process","index":4,"n_rows":29,"n_cols":903,"rows_kept":29,"cut":false,"hidden":false,"merged":[[1,890,1,895],[1,897,1,902],[1,855,1,860],[1,862,1,867],[1,869,1,874],[1,876,1,881],[1,883,1,888],[1,820,1,825],[1,827,1,832],[1,834,1,839],[1,841,1,846],[1,848,1,853],[1,785,1,790],[1,792,1,797],[1,799,1,804],[1,806,1,811],[1,813,1,818],[1,750,1,755],[1,757,1,762],[1,764,1,769],[1,771,1,776],[1,778,1,783],[1,715,1,720],[1,722,1,727],[1,729,1,734],[1,736,1,741],[1,743,1,748],[1,680,1,685],[1,687,1,692],[1,694,1,699],[1,701,1,706],[1,708,1,713],[1,36,1,41],[1,1,1,6],[1,8,1,13],[1,15,1,20],[1,22,1,27],[1,29,1,34],[1,120,1,125],[1,43,1,48],[1,50,1,55],[1,57,1,62],[1,64,1,69],[1,71,1,76],[1,78,1,83],[1,85,1,90],[1,92,1,97],[1,99,1,104],[1,106,1,111],[1,113,1,118],[1,204,1,209],[1,127,1,132],[1,134,1,139],[1,141,1,146],[1,148,1,153],[1,155,1,160],[1,162,1,167],[1,169,1,174],[1,176,1,181],[1,183,1,188],[1,190,1,195],[1,197,1,202],[1,288,1,293],[1,211,1,216],[1,218,1,223],[1,225,1,230],[1,232,1,237],[1,239,1,244],[1,246,1,251],[1,253,1,258],[1,260,1,265],[1,267,1,272],[1,274,1,279],[1,281,1,286],[1,372,1,377],[1,295,1,300],[1,302,1,307],[1,309,1,314],[1,316,1,321],[1,323,1,328],[1,330,1,335],[1,337,1,342],[1,344,1,349],[1,351,1,356],[1,358,1,363],[1,365,1,370],[1,456,1,461],[1,379,1,384],[1,386,1,391],[1,393,1,398],[1,400,1,405],[1,407,1,412],[1,414,1,419],[1,421,1,426],[1,428,1,433],[1,435,1,440],[1,442,1,447],[1,449,1,454],[1,540,1,545],[1,463,1,468],[1,470,1,475],[1,477,1,482],[1,484,1,489],[1,491,1,496],[1,498,1,503],[1,505,1,510],[1,512,1,517],[1,519,1,524],[1,526,1,531],[1,533,1,538],[1,673,1,678],[1,631,1,636],[1,638,1,643],[1,645,1,650],[1,652,1,657],[1,659,1,664],[1,666,1,671],[1,624,1,629],[1,547,1,552],[1,554,1,559],[1,561,1,566],[1,568,1,573],[1,575,1,580],[1,582,1,587],[1,589,1,594],[1,596,1,601],[1,603,1,608],[1,610,1,615],[1,617,1,622]]}
[]
[1,{"$f":"CONCATENATE(\"Round \",A2)","v":"Round 1"},null,null,null,null,null,{"$f":"A2+1","v":2},{"$f":"CONCATENATE(\"Round \",H2)","v":"Round 2"},null,null,null,null,null,{"$f":"H2+1","v":3},{"$f":"CONCATENATE(\"Round \",O2)","v":"Round 3"},null,null,null,null,null,{"$f":"O2+1","v":4},{"$f":"CONCATENATE(\"Round \",V2)","v":"Round 4"},null,null,null,null,null,{"$f":"V2+1","v":5},{"$f":"CONCATENATE(\"Round \",AC2)","v":"Round 5"},null,null,null,null,null,{"$f":"AC2+1","v":6},{"$f":"CONCATENATE(\"Round \",AJ2)","v":"Round 6"},null,null,null,null,null,{"$f":"AJ2+1","v":7},{"$f":"CONCATENATE(\"Round \",AQ2)","v":"Round 7"},null,null,null,null,null,{"$f":"AQ2+1","v":8},{"$f":"CONCATENATE(\"Round \",AX2)","v":"Round 8"},null,null,null,null,null,{"$f":"AX2+1","v":9},{"$f":"CONCATENATE(\"Round \",BE2)","v":"Round 9"},null,null,null,null,null,{"$f":"BE2+1","v":10},{"$f":"CONCATENATE(\"Round \",BL2)","v":"Round 10"},null,null,null,null,null,{"$f":"BL2+1","v":11},{"$f":"CONCATENATE(\"Round \",BS2)","v":"Round 11"},null,null,null,null,null,{"$f":"BS2+1","v":12},{"$f":"CONCATENATE(\"Round \",BZ2)","v":"Round 12"},null,null,null,null,null,{"$f":"BZ2+1","v":13},{"$f":"CONCATENATE(\"Round \",CG2)","v":"Round 13"},null,null,null,null,null,{"$f":"CG2+1","v":14},{"$f":"CONCATENATE(\"Round \",CN2)","v":"Round 14"},null,null,null,null,null,{"$f":"CN2+1","v":15},{"$f":"CONCATENATE(\"Round \",CU2)","v":"Round 15"},null,null,null,null,null,{"$f":"CU2+1","v":16},{"$f":"CONCATENATE(\"Round \",DB2)","v":"Round 16"},null,null,null,null,null,{"$f":"DB2+1","v":17},{"$f":"CONCATENATE(\"Round \",DI2)","v":"Round 17"},null,null,null,null,null,{"$f":"DI2+1","v":18},{"$f":"CONCATENATE(\"Round \",DP2)","v":"Round 18"},null,null,null,null,null,{"$f":"DP2+1","v":19},{"$f":"CONCATENATE(\"Round \",DW2)","v":"Round 19"},null,null,null,null,null,{"$f":"DW2+1","v":20},{"$f":"CONCATENATE(\"Round \",ED2)","v":"Round 20"},null,null,null,null,null,{"$f":"ED2+1","v":21},{"$f":"CONCATENATE(\"Round \",EK2)","v":"Round 21"},null,null,null,null,null,{"$f":"EK2+1","v":22},{"$f":"CONCATENATE(\"Round \",ER2)","v":"Round 22"},null,null,null,null,null,{"$f":"ER2+1","v":23},{"$f":"CONCATENATE(\"Round \",EY2)","v":"Round 23"},null,null,null,null,null,{"$f":"EY2+1","v":24},{"$f":"CONCATENATE(\"Round \",FF2)","v":"Round 24"},null,null,null,null,null,{"$f":"FF2+1","v":25},{"$f":"CONCATENATE(\"Round \",FM2)","v":"Round 25"},null,null,null,null,null,{"$f":"FM2+1","v":26},{"$f":"CONCATENATE(\"Round \",FT2)","v":"Round 26"},null,null,null,null,null,{"$f":"FT2+1","v":27},{"$f":"CONCATENATE(\"Round \",GA2)","v":"Round 27"},null,null,null,null,null,{"$f":"GA2+1","v":28},{"$f":"CONCATENATE(\"Round \",GH2)","v":"Round 28"},null,null,null,null,null,{"$f":"GH2+1","v":29},{"$f":"CONCATENATE(\"Round \",GO2)","v":"Round 29"},null,null,null,null,null,{"$f":"GO2+1","v":30},{"$f":"CONCATENATE(\"Round \",GV2)","v":"Round 30"},null,null,null,null,null,{"$f":"GV2+1","v":31},{"$f":"CONCATENATE(\"Round \",HC2)","v":"Round 31"},null,null,null,null,null,{"$f":"HC2+1","v":32},{"$f":"CONCATENATE(\"Round \",HJ2)","v":"Round 32"},null,null,null,null,null,{"$f":"HJ2+1","v":33},{"$f":"CONCATENATE(\"Round \",HQ2)","v":"Round 33"},null,null,null,null,null,{"$f":"HQ2+1","v":34},{"$f":"CONCATENATE(\"Round \",HX2)","v":"Round 34"},null,null,null,null,null,{"$f":"HX2+1","v":35},{"$f":"CONCATENATE(\"Round \",IE2)","v":"Round 35"},null,null,null,null,null,{"$f":"IE2+1","v":36},{"$f":"CONCATENATE(\"Round \",IL2)","v":"Round 36"},null,null,null,null,null,{"$f":"IL2+1","v":37},{"$f":"CONCATENATE(\"Round \",IS2)","v":"Round 37"},null,null,null,null,null,{"$f":"IS2+1","v":38},{"$f":"CONCATENATE(\"Round \",IZ2)","v":"Round 38"},null,null,null,null,null,{"$f":"IZ2+1","v":39},{"$f":"CONCATENATE(\"Round \",JG2)","v":"Round 39"},null,null,null,null,null,{"$f":"JG2+1","v":40},{"$f":"CONCATENATE(\"Round \",JN2)","v":"Round 40"},null,null,null,null,null,{"$f":"JN2+1","v":41},{"$f":"CONCATENATE(\"Round \",JU2)","v":"Round 41"},null,null,null,null,null,{"$f":"JU2+1","v":42},{"$f":"CONCATENATE(\"Round \",KB2)","v":"Round 42"},null,null,null,null,null,{"$f":"KB2+1","v":43},{"$f":"CONCATENATE(\"Round \",KI2)","v":"Round 43"},null,null,null,null,null,{"$f":"KI2+1","v":44},{"$f":"CONCATENATE(\"Round \",KP2)","v":"Round 44"},null,null,null,null,null,{"$f":"KP2+1","v":45},{"$f":"CONCATENATE(\"Round \",KW2)","v":"Round 45"},null,null,null,null,null,{"$f":"KW2+1","v":46},{"$f":"CONCATENATE(\"Round \",LD2)","v":"Round 46"},null,null,null,null,null,{"$f":"LD2+1","v":47},{"$f":"CONCATENATE(\"Round \",LK2)","v":"Round 47"},null,null,null,null,null,{"$f":"LK2+1","v":48},{"$f":"CONCATENATE(\"Round \",LR2)","v":"Round 48"},null,null,null,null,null,{"$f":"LR2+1","v":49},{"$f":"CONCATENATE(\"Round \",LY2)","v":"Round 49"},null,null,null,null,null,{"$f":"LY2+1","v":50},{"$f":"CONCATENATE(\"Round \",MF2)","v":"Round 50"},null,null,null,null,null,{"$f":"MF2+1","v":51},{"$f":"CONCATENATE(\"Round \",MM2)","v":"Round 51"},null,null,null,null,null,{"$f":"MM2+1","v":52},{"$f":"CONCATENATE(\"Round \",MT2)","v":"Round 52"},null,null,null,null,null,{"$f":"MT2+1","v":53},{"$f":"CONCATENATE(\"Round \",NA2)","v":"Round 53"},null,null,null,null,null,{"$f":"NA2+1","v":54},{"$f":"CONCATENATE(\"Round \",NH2)","v":"Round 54"},null,null,null,null,null,{"$f":"NH2+1","v":55},{"$f":"CONCATENATE(\"Round \",NO2)","v":"Round 55"},null,null,null,null,null,{"$f":"NO2+1","v":56},{"$f":"CONCATENATE(\"Round \",NV2)","v":"Round 56"},null,null,null,null,null,{"$f":"NV2+1","v":57},{"$f":"CONCATENATE(\"Round \",OC2)","v":"Round 57"},null,null,null,null,null,{"$f":"OC2+1","v":58},{"$f":"CONCATENATE(\"Round \",OJ2)","v":"Round 58"},null,null,null,null,null,{"$f":"OJ2+1","v":59},{"$f":"CONCATENATE(\"Round \",OQ2)","v":"Round 59"},null,null,null,null,null,{"$f":"OQ2+1","v":60},{"$f":"CONCATENATE(\"Round \",OX2)","v":"Round 60"},null,null,null,null,null,{"$f":"OX2+1","v":61},{"$f":"CONCATENATE(\"Round \",PE2)","v":"Round 61"},null,null,null,null,null,{"$f":"PE2+1","v":62},{"$f":"CONCATENATE(\"Round \",PL2)","v":"Round 62"},null,null,null,null,null,{"$f":"PL2+1","v":63},{"$f":"CONCATENATE(\"Round \",PS2)","v":"Round 63"},null,null,null,null,null,{"$f":"PS2+1","v":64},{"$f":"CONCATENATE(\"Round \",PZ2)","v":"Round 64"},null,null,null,null,null,{"$f":"PZ2+1","v":65},{"$f":"CONCATENATE(\"Round \",QG2)","v":"Round 65"},null,null,null,null,null,{"$f":"QG2+1","v":66},{"$f":"CONCATENATE(\"Round \",QN2)","v":"Round 66"},null,null,null,null,null,{"$f":"QN2+1","v":67},{"$f":"CONCATENATE(\"Round \",QU2)","v":"Round 67"},null,null,null,null,null,{"$f":"QU2+1","v":68},{"$f":"CONCATENATE(\"Round \",RB2)","v":"Round 68"},null,null,null,null,null,{"$f":"RB2+1","v":69},{"$f":"CONCATENATE(\"Round \",RI2)","v":"Round 69"},null,null,null,null,null,{"$f":"RI2+1","v":70},{"$f":"CONCATENATE(\"Round \",RP2)","v":"Round 70"},null,null,null,null,null,{"$f":"RP2+1","v":71},{"$f":"CONCATENATE(\"Round \",RW2)","v":"Round 71"},null,null,null,null,null,{"$f":"RW2+1","v":72},{"$f":"CONCATENATE(\"Round \",SD2)","v":"Round 72"},null,null,null,null,null,{"$f":"SD2+1","v":73},{"$f":"CONCATENATE(\"Round \",SK2)","v":"Round 73"},null,null,null,null,null,{"$f":"SK2+1","v":74},{"$f":"CONCATENATE(\"Round \",SR2)","v":"Round 74"},null,null,null,null,null,{"$f":"SR2+1","v":75},{"$f":"CONCATENATE(\"Round \",SY2)","v":"Round 75"},null,null,null,null,null,{"$f":"SY2+1","v":76},{"$f":"CONCATENATE(\"Round \",TF2)","v":"Round 76"},null,null,null,null,null,{"$f":"TF2+1","v":77},{"$f":"CONCATENATE(\"Round \",TM2)","v":"Round 77"},null,null,null,null,null,{"$f":"TM2+1","v":78},{"$f":"CONCATENATE(\"Round \",TT2)","v":"Round 78"},null,null,null,null,null,{"$f":"TT2+1","v":79},{"$f":"CONCATENATE(\"Round \",UA2)","v":"Round 79"},null,null,null,null,null,{"$f":"UA2+1","v":80},{"$f":"CONCATENATE(\"Round \",UH2)","v":"Round 80"},null,null,null,null,null,{"$f":"UH2+1","v":81},{"$f":"CONCATENATE(\"Round \",UO2)","v":"Round 81"},null,null,null,null,null,{"$f":"UO2+1","v":82},{"$f":"CONCATENATE(\"Round \",UV2)","v":"Round 82"},null,null,null,null,null,{"$f":"UV2+1","v":83},{"$f":"CONCATENATE(\"Round \",VC2)","v":"Round 83"},null,null,null,null,null,{"$f":"VC2+1","v":84},{"$f":"CONCATENATE(\"Round \",VJ2)","v":"Round 84"},null,null,null,null,null,{"$f":"VJ2+1","v":85},{"$f":"CONCATENATE(\"Round \",VQ2)","v":"Round 85"},null,null,null,null,null,{"$f":"VQ2+1","v":86},{"$f":"CONCATENATE(\"Round \",VX2)","v":"Round 86"},null,null,null,null,null,{"$f":"VX2+1","v":87},{"$f":"CONCATENATE(\"Round \",WE2)","v":"Round 87"},null,null,null,null,null,{"$f":"WE2+1","v":88},{"$f":"CONCATENATE(\"Round \",WL2)","v":"Round 88"},null,null,null,null,null,{"$f":"WL2+1","v":89},{"$f":"CONCATENATE(\"Round \",WS2)","v":"Round 89"},null,null,null,null,null,{"$f":"WS2+1","v":90},{"$f":"CONCATENATE(\"Round \",WZ2)","v":"Round 90"},null,null,null,null,null,{"$f":"WZ2+1","v":91},{"$f":"CONCATENATE(\"Round \",XG2)","v":"Round 91"},null,null,null,null,null,{"$f":"XG2+1","v":92},{"$f":"CONCATENATE(\"Round \",XN2)","v":"Round 92"},null,null,null,null,null,{"$f":"XN2+1","v":93},{"$f":"CONCATENATE(\"Round \",XU2)","v":"Round 93"},null,null,null,null,null,{"$f":"XU2+1","v":94},{"$f":"CONCATENATE(\"Round \",YB2)","v":"Round 94"},null,null,null,null,null,{"$f":"YB2+1","v":95},{"$f":"CONCATENATE(\"Round \",YI2)","v":"Round 95"},null,null,null,null,null,{"$f":"YI2+1","v":96},{"$f":"CONCATENATE(\"Round \",YP2)","v":"Round 96"},null,null,null,null,null,{"$f":"YP2+1","v":97},{"$f":"CONCATENATE(\"Round \",YW2)","v":"Round 97"},null,null,null,null,null,{"$f":"YW2+1","v":98},{"$f":"CONCATENATE(\"Round \",ZD2)","v":"Round 98"},null,null,null,null,null,{"$f":"ZD2+1","v":99},{"$f":"CONCATENATE(\"Round \",ZK2)","v":"Round 99"},null,null,null,null,null,{"$f":"ZK2+1","v":100},{"$f":"CONCATENATE(\"Round \",ZR2)","v":"Round 100"},null,null,null,null,null,{"$f":"ZR2+1","v":101},{"$f":"CONCATENATE(\"Round \",ZY2)","v":"Round 101"},null,null,null,null,null,{"$f":"ZY2+1","v":102},{"$f":"CONCATENATE(\"Round \",AAF2)","v":"Round 102"},null,null,null,null,null,{"$f":"AAF2+1","v":103},{"$f":"CONCATENATE(\"Round \",AAM2)","v":"Round 103"},null,null,null,null,null,{"$f":"AAM2+1","v":104},{"$f":"CONCATENATE(\"Round \",AAT2)","v":"Round 104"},null,null,null,null,null,{"$f":"AAT2+1","v":105},{"$f":"CONCATENATE(\"Round \",ABA2)","v":"Round 105"},null,null,null,null,null,{"$f":"ABA2+1","v":106},{"$f":"CONCATENATE(\"Round \",ABH2)","v":"Round 106"},null,null,null,null,null,{"$f":"ABH2+1","v":107},{"$f":"CONCATENATE(\"Round \",ABO2)","v":"Round 107"},null,null,null,null,null,{"$f":"ABO2+1","v":108},{"$f":"CONCATENATE(\"Round \",ABV2)","v":"Round 108"},null,null,null,null,null,{"$f":"ABV2+1","v":109},{"$f":"CONCATENATE(\"Round \",ACC2)","v":"Round 109"},null,null,null,null,null,{"$f":"ACC2+1","v":110},{"$f":"CONCATENATE(\"Round \",ACJ2)","v":"Round 110"},null,null,null,null,null,{"$f":"ACJ2+1","v":111},{"$f":"CONCATENATE(\"Round \",ACQ2)","v":"Round 111"},null,null,null,null,null,{"$f":"ACQ2+1","v":112},{"$f":"CONCATENATE(\"Round \",ACX2)","v":"Round 112"},null,null,null,null,null,{"$f":"ACX2+1","v":113},{"$f":"CONCATENATE(\"Round \",ADE2)","v":"Round 113"},null,null,null,null,null,{"$f":"ADE2+1","v":114},{"$f":"CONCATENATE(\"Round \",ADL2)","v":"Round 114"},null,null,null,null,null,{"$f":"ADL2+1","v":115},{"$f":"CONCATENATE(\"Round \",ADS2)","v":"Round 115"},null,null,null,null,null,{"$f":"ADS2+1","v":116},{"$f":"CONCATENATE(\"Round \",ADZ2)","v":"Round 116"},null,null,null,null,null,{"$f":"ADZ2+1","v":117},{"$f":"CONCATENATE(\"Round \",AEG2)","v":"Round 117"},null,null,null,null,null,{"$f":"AEG2+1","v":118},{"$f":"CONCATENATE(\"Round \",AEN2)","v":"Round 118"},null,null,null,null,null,{"$f":"AEN2+1","v":119},{"$f":"CONCATENATE(\"Round \",AEU2)","v":"Round 119"},null,null,null,null,null,{"$f":"AEU2+1","v":120},{"$f":"CONCATENATE(\"Round \",AFB2)","v":"Round 120"},null,null,null,null,null,{"$f":"AFB2+1","v":121},{"$f":"CONCATENATE(\"Round \",AFI2)","v":"Round 121"},null,null,null,null,null,{"$f":"AFI2+1","v":122},{"$f":"CONCATENATE(\"Round \",AFP2)","v":"Round 122"},null,null,null,null,null,{"$f":"AFP2+1","v":123},{"$f":"CONCATENATE(\"Round \",AFW2)","v":"Round 123"},null,null,null,null,null,{"$f":"AFW2+1","v":124},{"$f":"CONCATENATE(\"Round \",AGD2)","v":"Round 124"},null,null,null,null,null,{"$f":"AGD2+1","v":125},{"$f":"CONCATENATE(\"Round \",AGK2)","v":"Round 125"},null,null,null,null,null,{"$f":"AGK2+1","v":126},{"$f":"CONCATENATE(\"Round \",AGR2)","v":"Round 126"},null,null,null,null,null,{"$f":"AGR2+1","v":127},{"$f":"CONCATENATE(\"Round \",AGY2)","v":"Round 127"},null,null,null,null,null,{"$f":"AGY2+1","v":128},{"$f":"CONCATENATE(\"Round \",AHF2)","v":"Round 128"},null,null,null,null,null,{"$f":"AHF2+1","v":129},{"$f":"CONCATENATE(\"Round \",AHM2)","v":"Round 129"}]
[{"$f":"SUM(G4:G625)","v":0},"Graduate","Choice #","Proposes to","Ranking","Relative Ranking","Decision",null,{"$f":"B3","v":"Graduate"},{"$f":"C3","v":"Choice #"},"Proposes to","Ranking","Relative Ranking","Decision",null,{"$f":"I3","v":"Graduate"},{"$f":"J3","v":"Choice #"},{"$f":"K3","v":"Proposes to"},{"$f":"L3","v":"Ranking"},{"$f":"M3","v":"Relative Ranking"},{"$f":"N3","v":"Decision"},null,{"$f":"P3","v":"Graduate"},{"$f":"Q3","v":"Choice #"},{"$f":"R3","v":"Proposes to"},{"$f":"S3","v":"Ranking"},{"$f":"T3","v":"Relative Ranking"},{"$f":"U3","v":"Decision"},null,{"$f":"W3","v":"Graduate"},{"$f":"X3","v":"Choice #"},{"$f":"Y3","v":"Proposes to"},{"$f":"Z3","v":"Ranking"},{"$f":"AA3","v":"Relative Ranking"},{"$f":"AB3","v":"Decision"},null,{"$f":"AD3","v":"Graduate"},{"$f":"AE3","v":"Choice #"},{"$f":"AF3","v":"Proposes to"},{"$f":"AG3","v":"Ranking"},{"$f":"AH3","v":"Relative Ranking"},{"$f":"AI3","v":"Decision"},null,{"$f":"AK3","v":"Graduate"},{"$f":"AL3","v":"Choice #"},{"$f":"AM3","v":"Proposes to"},{"$f":"AN3","v":"Ranking"},{"$f":"AO3","v":"Relative Ranking"},{"$f":"AP3","v":"Decision"},null,{"$f":"AR3","v":"Graduate"},{"$f":"AS3","v":"Choice #"},{"$f":"AT3","v":"Proposes to"},{"$f":"AU3","v":"Ranking"},{"$f":"AV3","v":"Relative Ranking"},{"$f":"AW3","v":"Decision"},null,{"$f":"AY3","v":"Graduate"},{"$f":"AZ3","v":"Choice #"},{"$f":"BA3","v":"Proposes to"},{"$f":"BB3","v":"Ranking"},{"$f":"BC3","v":"Relative Ranking"},{"$f":"BD3","v":"Decision"},null,{"$f":"BF3","v":"Graduate"},{"$f":"BG3","v":"Choice #"},{"$f":"BH3","v":"Proposes to"},{"$f":"BI3","v":"Ranking"},{"$f":"BJ3","v":"Relative Ranking"},{"$f":"BK3","v":"Decision"},null,{"$f":"BM3","v":"Graduate"},{"$f":"BN3","v":"Choice #"},{"$f":"BO3","v":"Proposes to"},{"$f":"BP3","v":"Ranking"},{"$f":"BQ3","v":"Relative Ranking"},{"$f":"BR3","v":"Decision"},null,{"$f":"BT3","v":"Graduate"},{"$f":"BU3","v":"Choice #"},{"$f":"BV3","v":"Proposes to"},{"$f":"BW3","v":"Ranking"},{"$f":"BX3","v":"Relative Ranking"},{"$f":"BY3","v":"Decision"},null,{"$f":"CA3","v":"Graduate"},{"$f":"CB3","v":"Choice #"},{"$f":"CC3","v":"Proposes to"},{"$f":"CD3","v":"Ranking"},{"$f":"CE3","v":"Relative Ranking"},{"$f":"CF3","v":"Decision"},null,{"$f":"CH3","v":"Graduate"},{"$f":"CI3","v":"Choice #"},{"$f":"CJ3","v":"Proposes to"},{"$f":"CK3","v":"Ranking"},{"$f":"CL3","v":"Relative Ranking"},{"$f":"CM3","v":"Decision"},null,{"$f":"CO3","v":"Graduate"},{"$f":"CP3","v":"Choice #"},{"$f":"CQ3","v":"Proposes to"},{"$f":"CR3","v":"Ranking"},{"$f":"CS3","v":"Relative Ranking"},{"$f":"CT3","v":"Decision"},null,{"$f":"CV3","v":"Graduate"},{"$f":"CW3","v":"Choice #"},{"$f":"CX3","v":"Proposes to"},{"$f":"CY3","v":"Ranking"},{"$f":"CZ3","v":"Relative Ranking"},{"$f":"DA3","v":"Decision"},null,{"$f":"DC3","v":"Graduate"},{"$f":"DD3","v":"Choice #"},{"$f":"DE3","v":"Proposes to"},{"$f":"DF3","v":"Ranking"},{"$f":"DG3","v":"Relative Ranking"},{"$f":"DH3","v":"Decision"},null,{"$f":"DJ3","v":"Graduate"},{"$f":"DK3","v":"Choice #"},{"$f":"DL3","v":"Proposes to"},{"$f":"DM3","v":"Ranking"},{"$f":"DN3","v":"Relative Ranking"},{"$f":"DO3","v":"Decision"},null,{"$f":"DQ3","v":"Graduate"},{"$f":"DR3","v":"Choice #"},{"$f":"DS3","v":"Proposes to"},{"$f":"DT3","v":"Ranking"},{"$f":"DU3","v":"Relative Ranking"},{"$f":"DV3","v":"Decision"},null,{"$f":"DX3","v":"Graduate"},{"$f":"DY3","v":"Choice #"},{"$f":"DZ3","v":"Proposes to"},{"$f":"EA3","v":"Ranking"},{"$f":"EB3","v":"Relative Ranking"},{"$f":"EC3","v":"Decision"},null,{"$f":"EE3","v":"Graduate"},{"$f":"EF3","v":"Choice #"},{"$f":"EG3","v":"Proposes to"},{"$f":"EH3","v":"Ranking"},{"$f":"EI3","v":"Relative Ranking"},{"$f":"EJ3","v":"Decision"},null,{"$f":"EL3","v":"Graduate"},{"$f":"EM3","v":"Choice #"},{"$f":"EN3","v":"Proposes to"},{"$f":"EO3","v":"Ranking"},{"$f":"EP3","v":"Relative Ranking"},{"$f":"EQ3","v":"Decision"},null,{"$f":"ES3","v":"Graduate"},{"$f":"ET3","v":"Choice #"},{"$f":"EU3","v":"Proposes to"},{"$f":"EV3","v":"Ranking"},{"$f":"EW3","v":"Relative Ranking"},{"$f":"EX3","v":"Decision"},null,{"$f":"EZ3","v":"Graduate"},{"$f":"FA3","v":"Choice #"},{"$f":"FB3","v":"Proposes to"},{"$f":"FC3","v":"Ranking"},{"$f":"FD3","v":"Relative Ranking"},{"$f":"FE3","v":"Decision"},null,{"$f":"FG3","v":"Graduate"},{"$f":"FH3","v":"Choice #"},{"$f":"FI3","v":"Proposes to"},{"$f":"FJ3","v":"Ranking"},{"$f":"FK3","v":"Relative Ranking"},{"$f":"FL3","v":"Decision"},null,{"$f":"FN3","v":"Graduate"},{"$f":"FO3","v":"Choice #"},{"$f":"FP3","v":"Proposes to"},{"$f":"FQ3","v":"Ranking"},{"$f":"FR3","v":"Relative Ranking"},{"$f":"FS3","v":"Decision"},null,{"$f":"FU3","v":"Graduate"},{"$f":"FV3","v":"Choice #"},{"$f":"FW3","v":"Proposes to"},{"$f":"FX3","v":"Ranking"},{"$f":"FY3","v":"Relative Ranking"},{"$f":"FZ3","v":"Decision"},null,{"$f":"GB3","v":"Graduate"},{"$f":"GC3","v":"Choice #"},{"$f":"GD3","v":"Proposes to"},{"$f":"GE3","v":"Ranking"},{"$f":"GF3","v":"Relative Ranking"},{"$f":"GG3","v":"Decision"},null,{"$f":"GI3","v":"Graduate"},{"$f":"GJ3","v":"Choice #"},{"$f":"GK3","v":"Proposes to"},{"$f":"GL3","v":"Ranking"},{"$f":"GM3","v":"Relative Ranking"},{"$f":"GN3","v":"Decision"},null,{"$f":"GP3","v":"Graduate"},{"$f":"GQ3","v":"Choice #"},{"$f":"GR3","v":"Proposes to"},{"$f":"GS3","v":"Ranking"},{"$f":"GT3","v":"Relative Ranking"},{"$f":"GU3","v":"Decision"},null,{"$f":"GW3","v":"Graduate"},{"$f":"GX3","v":"Choice #"},{"$f":"GY3","v":"Proposes to"},{"$f":"GZ3","v":"Ranking"},{"$f":"HA3","v":"Relative Ranking"},{"$f":"HB3","v":"Decision"},null,{"$f":"HD3","v":"Graduate"},{"$f":"HE3","v":"Choice #"},{"$f":"HF3","v":"Proposes to"},{"$f":"HG3","v":"Ranking"},{"$f":"HH3","v":"Relative Ranking"},{"$f":"HI3","v":"Decision"},null,{"$f":"HK3","v":"Graduate"},{"$f":"HL3","v":"Choice #"},{"$f":"HM3","v":"Proposes to"},{"$f":"HN3","v":"Ranking"},{"$f":"HO3","v":"Relative Ranking"},{"$f":"HP3","v":"Decision"},null,{"$f":"HR3","v":"Graduate"},{"$f":"HS3","v":"Choice #"},{"$f":"HT3","v":"Proposes to"},{"$f":"HU3","v":"Ranking"},{"$f":"HV3","v":"Relative Ranking"},{"$f":"HW3","v":"Decision"},null,{"$f":"HY3","v":"Graduate"},{"$f":"HZ3","v":"Choice #"},{"$f":"IA3","v":"Proposes to"},{"$f":"IB3","v":"Ranking"},{"$f":"IC3","v":"Relative Ranking"},{"$f":"ID3","v":"Decision"},null,{"$f":"IF3","v":"Graduate"},{"$f":"IG3","v":"Choice #"},{"$f":"IH3","v":"Proposes to"},{"$f":"II3","v":"Ranking"},{"$f":"IJ3","v":"Relative Ranking"},{"$f":"IK3","v":"Decision"},null,{"$f":"IM3","v":"Graduate"},{"$f":"IN3","v":"Choice #"},{"$f":"IO3","v":"Proposes to"},{"$f":"IP3","v":"Ranking"},{"$f":"IQ3","v":"Relative Ranking"},{"$f":"IR3","v":"Decision"},null,{"$f":"IT3","v":"Graduate"},{"$f":"IU3","v":"Choice #"},{"$f":"IV3","v":"Proposes to"},{"$f":"IW3","v":"Ranking"},{"$f":"IX3","v":"Relative Ranking"},{"$f":"IY3","v":"Decision"},null,{"$f":"JA3","v":"Graduate"},{"$f":"JB3","v":"Choice #"},{"$f":"JC3","v":"Proposes to"},{"$f":"JD3","v":"Ranking"},{"$f":"JE3","v":"Relative Ranking"},{"$f":"JF3","v":"Decision"},null,{"$f":"JH3","v":"Graduate"},{"$f":"JI3","v":"Choice #"},{"$f":"JJ3","v":"Proposes to"},{"$f":"JK3","v":"Ranking"},{"$f":"JL3","v":"Relative Ranking"},{"$f":"JM3","v":"Decision"},null,{"$f":"JO3","v":"Graduate"},{"$f":"JP3","v":"Choice #"},{"$f":"JQ3","v":"Proposes to"},{"$f":"JR3","v":"Ranking"},{"$f":"JS3","v":"Relative Ranking"},{"$f":"JT3","v":"Decision"},null,{"$f":"JV3","v":"Graduate"},{"$f":"JW3","v":"Choice #"},{"$f":"JX3","v":"Proposes to"},{"$f":"JY3","v":"Ranking"},{"$f":"JZ3","v":"Relative Ranking"},{"$f":"KA3","v":"Decision"},null,{"$f":"KC3","v":"Graduate"},{"$f":"KD3","v":"Choice #"},{"$f":"KE3","v":"Proposes to"},{"$f":"KF3","v":"Ranking"},{"$f":"KG3","v":"Relative Ranking"},{"$f":"KH3","v":"Decision"},null,{"$f":"KJ3","v":"Graduate"},{"$f":"KK3","v":"Choice #"},{"$f":"KL3","v":"Proposes to"},{"$f":"KM3","v":"Ranking"},{"$f":"KN3","v":"Relative Ranking"},{"$f":"KO3","v":"Decision"},null,{"$f":"KQ3","v":"Graduate"},{"$f":"KR3","v":"Choice #"},{"$f":"KS3","v":"Proposes to"},{"$f":"KT3","v":"Ranking"},{"$f":"KU3","v":"Relative Ranking"},{"$f":"KV3","v":"Decision"},null,{"$f":"KX3","v":"Graduate"},{"$f":"KY3","v":"Choice #"},{"$f":"KZ3","v":"Proposes to"},{"$f":"LA3","v":"Ranking"},{"$f":"LB3","v":"Relative Ranking"},{"$f":"LC3","v":"Decision"},null,{"$f":"LE3","v":"Graduate"},{"$f":"LF3","v":"Choice #"},{"$f":"LG3","v":"Proposes to"},{"$f":"LH3","v":"Ranking"},{"$f":"LI3","v":"Relative Ranking"},{"$f":"LJ3","v":"Decision"},null,{"$f":"LL3","v":"Graduate"},{"$f":"LM3","v":"Choice #"},{"$f":"LN3","v":"Proposes to"},{"$f":"LO3","v":"Ranking"},{"$f":"LP3","v":"Relative Ranking"},{"$f":"LQ3","v":"Decision"},null,{"$f":"LS3","v":"Graduate"},{"$f":"LT3","v":"Choice #"},{"$f":"LU3","v":"Proposes to"},{"$f":"LV3","v":"Ranking"},{"$f":"LW3","v":"Relative Ranking"},{"$f":"LX3","v":"Decision"},null,{"$f":"LZ3","v":"Graduate"},{"$f":"MA3","v":"Choice #"},{"$f":"MB3","v":"Proposes to"},{"$f":"MC3","v":"Ranking"},{"$f":"MD3","v":"Relative Ranking"},{"$f":"ME3","v":"Decision"},null,{"$f":"MG3","v":"Graduate"},{"$f":"MH3","v":"Choice #"},{"$f":"MI3","v":"Proposes to"},{"$f":"MJ3","v":"Ranking"},{"$f":"MK3","v":"Relative Ranking"},{"$f":"ML3","v":"Decision"},null,{"$f":"MN3","v":"Graduate"},{"$f":"MO3","v":"Choice #"},{"$f":"MP3","v":"Proposes to"},{"$f":"MQ3","v":"Ranking"},{"$f":"MR3","v":"Relative Ranking"},{"$f":"MS3","v":"Decision"},null,{"$f":"MU3","v":"Graduate"},{"$f":"MV3","v":"Choice #"},{"$f":"MW3","v":"Proposes to"},{"$f":"MX3","v":"Ranking"},{"$f":"MY3","v":"Relative Ranking"},{"$f":"MZ3","v":"Decision"},null,{"$f":"NB3","v":"Graduate"},{"$f":"NC3","v":"Choice #"},{"$f":"ND3","v":"Proposes to"},{"$f":"NE3","v":"Ranking"},{"$f":"NF3","v":"Relative Ranking"},{"$f":"NG3","v":"Decision"},null,{"$f":"NI3","v":"Graduate"},{"$f":"NJ3","v":"Choice #"},{"$f":"NK3","v":"Proposes to"},{"$f":"NL3","v":"Ranking"},{"$f":"NM3","v":"Relative Ranking"},{"$f":"NN3","v":"Decision"},null,{"$f":"NP3","v":"Graduate"},{"$f":"NQ3","v":"Choice #"},{"$f":"NR3","v":"Proposes to"},{"$f":"NS3","v":"Ranking"},{"$f":"NT3","v":"Relative Ranking"},{"$f":"NU3","v":"Decision"},null,{"$f":"NW3","v":"Graduate"},{"$f":"NX3","v":"Choice #"},{"$f":"NY3","v":"Proposes to"},{"$f":"NZ3","v":"Ranking"},{"$f":"OA3","v":"Relative Ranking"},{"$f":"OB3","v":"Decision"},null,{"$f":"OD3","v":"Graduate"},{"$f":"OE3","v":"Choice #"},{"$f":"OF3","v":"Proposes to"},{"$f":"OG3","v":"Ranking"},{"$f":"OH3","v":"Relative Ranking"},{"$f":"OI3","v":"Decision"},null,{"$f":"OK3","v":"Graduate"},{"$f":"OL3","v":"Choice #"},{"$f":"OM3","v":"Proposes to"},{"$f":"ON3","v":"Ranking"},{"$f":"OO3","v":"Relative Ranking"},{"$f":"OP3","v":"Decision"},null,{"$f":"OR3","v":"Graduate"},{"$f":"OS3","v":"Choice #"},{"$f":"OT3","v":"Proposes to"},{"$f":"OU3","v":"Ranking"},{"$f":"OV3","v":"Relative Ranking"},{"$f":"OW3","v":"Decision"},null,{"$f":"OY3","v":"Graduate"},{"$f":"OZ3","v":"Choice #"},{"$f":"PA3","v":"Proposes to"},{"$f":"PB3","v":"Ranking"},{"$f":"PC3","v":"Relative Ranking"},{"$f":"PD3","v":"Decision"},null,{"$f":"PF3","v":"Graduate"},{"$f":"PG3","v":"Choice #"},{"$f":"PH3","v":"Proposes to"},{"$f":"PI3","v":"Ranking"},{"$f":"PJ3","v":"Relative Ranking"},{"$f":"PK3","v":"Decision"},null,{"$f":"PM3","v":"Graduate"},{"$f":"PN3","v":"Choice #"},{"$f":"PO3","v":"Proposes to"},{"$f":"PP3","v":"Ranking"},{"$f":"PQ3","v":"Relative Ranking"},{"$f":"PR3","v":"Decision"},null,{"$f":"PT3","v":"Graduate"},{"$f":"PU3","v":"Choice #"},{"$f":"PV3","v":"Proposes to"},{"$f":"PW3","v":"Ranking"},{"$f":"PX3","v":"Relative Ranking"},{"$f":"PY3","v":"Decision"},null,{"$f":"QA3","v":"Graduate"},{"$f":"QB3","v":"Choice #"},{"$f":"QC3","v":"Proposes to"},{"$f":"QD3","v":"Ranking"},{"$f":"QE3","v":"Relative Ranking"},{"$f":"QF3","v":"Decision"},null,{"$f":"QH3","v":"Graduate"},{"$f":"QI3","v":"Choice #"},{"$f":"QJ3","v":"Proposes to"},{"$f":"QK3","v":"Ranking"},{"$f":"QL3","v":"Relative Ranking"},{"$f":"QM3","v":"Decision"},null,{"$f":"QO3","v":"Graduate"},{"$f":"QP3","v":"Choice #"},{"$f":"QQ3","v":"Proposes to"},{"$f":"QR3","v":"Ranking"},{"$f":"QS3","v":"Relative Ranking"},{"$f":"QT3","v":"Decision"},null,{"$f":"QV3","v":"Graduate"},{"$f":"QW3","v":"Choice #"},{"$f":"QX3","v":"Proposes to"},{"$f":"QY3","v":"Ranking"},{"$f":"QZ3","v":"Relative Ranking"},{"$f":"RA3","v":"Decision"},null,{"$f":"RC3","v":"Graduate"},{"$f":"RD3","v":"Choice #"},{"$f":"RE3","v":"Proposes to"},{"$f":"RF3","v":"Ranking"},{"$f":"RG3","v":"Relative Ranking"},{"$f":"RH3","v":"Decision"},null,{"$f":"RJ3","v":"Graduate"},{"$f":"RK3","v":"Choice #"},{"$f":"RL3","v":"Proposes to"},{"$f":"RM3","v":"Ranking"},{"$f":"RN3","v":"Relative Ranking"},{"$f":"RO3","v":"Decision"},null,{"$f":"RQ3","v":"Graduate"},{"$f":"RR3","v":"Choice #"},{"$f":"RS3","v":"Proposes to"},{"$f":"RT3","v":"Ranking"},{"$f":"RU3","v":"Relative Ranking"},{"$f":"RV3","v":"Decision"},null,{"$f":"RX3","v":"Graduate"},{"$f":"RY3","v":"Choice #"},{"$f":"RZ3","v":"Proposes to"},{"$f":"SA3","v":"Ranking"},{"$f":"SB3","v":"Relative Ranking"},{"$f":"SC3","v":"Decision"},null,{"$f":"SE3","v":"Graduate"},{"$f":"SF3","v":"Choice #"},{"$f":"SG3","v":"Proposes to"},{"$f":"SH3","v":"Ranking"},{"$f":"SI3","v":"Relative Ranking"},{"$f":"SJ3","v":"Decision"},null,{"$f":"SL3","v":"Graduate"},{"$f":"SM3","v":"Choice #"},{"$f":"SN3","v":"Proposes to"},{"$f":"SO3","v":"Ranking"},{"$f":"SP3","v":"Relative Ranking"},{"$f":"SQ3","v":"Decision"},null,{"$f":"SS3","v":"Graduate"},{"$f":"ST3","v":"Choice #"},{"$f":"SU3","v":"Proposes to"},{"$f":"SV3","v":"Ranking"},{"$f":"SW3","v":"Relative Ranking"},{"$f":"SX3","v":"Decision"},null,{"$f":"SZ3","v":"Graduate"},{"$f":"TA3","v":"Choice #"},{"$f":"TB3","v":"Proposes to"},{"$f":"TC3","v":"Ranking"},{"$f":"TD3","v":"Relative Ranking"},{"$f":"TE3","v":"Decision"},null,{"$f":"TG3","v":"Graduate"},{"$f":"TH3","v":"Choice #"},{"$f":"TI3","v":"Proposes to"},{"$f":"TJ3","v":"Ranking"},{"$f":"TK3","v":"Relative Ranking"},{"$f":"TL3","v":"Decision"},null,{"$f":"TN3","v":"Graduate"},{"$f":"TO3","v":"Choice #"},{"$f":"TP3","v":"Proposes to"},{"$f":"TQ3","v":"Ranking"},{"$f":"TR3","v":"Relative Ranking"},{"$f":"TS3","v":"Decision"},null,{"$f":"TU3","v":"Graduate"},{"$f":"TV3","v":"Choice #"},{"$f":"TW3","v":"Proposes to"},{"$f":"TX3","v":"Ranking"},{"$f":"TY3","v":"Relative Ranking"},{"$f":"TZ3","v":"Decision"},null,{"$f":"UB3","v":"Graduate"},{"$f":"UC3","v":"Choice #"},{"$f":"UD3","v":"Proposes to"},{"$f":"UE3","v":"Ranking"},{"$f":"UF3","v":"Relative Ranking"},{"$f":"UG3","v":"Decision"},null,{"$f":"UI3","v":"Graduate"},{"$f":"UJ3","v":"Choice #"},{"$f":"UK3","v":"Proposes to"},{"$f":"UL3","v":"Ranking"},{"$f":"UM3","v":"Relative Ranking"},{"$f":"UN3","v":"Decision"},null,{"$f":"UP3","v":"Graduate"},{"$f":"UQ3","v":"Choice #"},{"$f":"UR3","v":"Proposes to"},{"$f":"US3","v":"Ranking"},{"$f":"UT3","v":"Relative Ranking"},{"$f":"UU3","v":"Decision"},null,{"$f":"UW3","v":"Graduate"},{"$f":"UX3","v":"Choice #"},{"$f":"UY3","v":"Proposes to"},{"$f":"UZ3","v":"Ranking"},{"$f":"VA3","v":"Relative Ranking"},{"$f":"VB3","v":"Decision"},null,{"$f":"VD3","v":"Graduate"},{"$f":"VE3","v":"Choice #"},{"$f":"VF3","v":"Proposes to"},{"$f":"VG3","v":"Ranking"},{"$f":"VH3","v":"Relative Ranking"},{"$f":"VI3","v":"Decision"},null,{"$f":"VK3","v":"Graduate"},{"$f":"VL3","v":"Choice #"},{"$f":"VM3","v":"Proposes to"},{"$f":"VN3","v":"Ranking"},{"$f":"VO3","v":"Relative Ranking"},{"$f":"VP3","v":"Decision"},null,{"$f":"VR3","v":"Graduate"},{"$f":"VS3","v":"Choice #"},{"$f":"VT3","v":"Proposes to"},{"$f":"VU3","v":"Ranking"},{"$f":"VV3","v":"Relative Ranking"},{"$f":"VW3","v":"Decision"},null,{"$f":"VY3","v":"Graduate"},{"$f":"VZ3","v":"Choice #"},{"$f":"WA3","v":"Proposes to"},{"$f":"WB3","v":"Ranking"},{"$f":"WC3","v":"Relative Ranking"},{"$f":"WD3","v":"Decision"},null,{"$f":"WF3","v":"Graduate"},{"$f":"WG3","v":"Choice #"},{"$f":"WH3","v":"Proposes to"},{"$f":"WI3","v":"Ranking"},{"$f":"WJ3","v":"Relative Ranking"},{"$f":"WK3","v":"Decision"},null,{"$f":"WM3","v":"Graduate"},{"$f":"WN3","v":"Choice #"},{"$f":"WO3","v":"Proposes to"},{"$f":"WP3","v":"Ranking"},{"$f":"WQ3","v":"Relative Ranking"},{"$f":"WR3","v":"Decision"},null,{"$f":"WT3","v":"Graduate"},{"$f":"WU3","v":"Choice #"},{"$f":"WV3","v":"Proposes to"},{"$f":"WW3","v":"Ranking"},{"$f":"WX3","v":"Relative Ranking"},{"$f":"WY3","v":"Decision"},null,{"$f":"XA3","v":"Graduate"},{"$f":"XB3","v":"Choice #"},{"$f":"XC3","v":"Proposes to"},{"$f":"XD3","v":"Ranking"},{"$f":"XE3","v":"Relative Ranking"},{"$f":"XF3","v":"Decision"},null,{"$f":"XH3","v":"Graduate"},{"$f":"XI3","v":"Choice #"},{"$f":"XJ3","v":"Proposes to"},{"$f":"XK3","v":"Ranking"},{"$f":"XL3","v":"Relative Ranking"},{"$f":"XM3","v":"Decision"},null,{"$f":"XO3","v":"Graduate"},{"$f":"XP3","v":"Choice #"},{"$f":"XQ3","v":"Proposes to"},{"$f":"XR3","v":"Ranking"},{"$f":"XS3","v":"Relative Ranking"},{"$f":"XT3","v":"Decision"},null,{"$f":"XV3","v":"Graduate"},{"$f":"XW3","v":"Choice #"},{"$f":"XX3","v":"Proposes to"},{"$f":"XY3","v":"Ranking"},{"$f":"XZ3","v":"Relative Ranking"},{"$f":"YA3","v":"Decision"},null,{"$f":"YC3","v":"Graduate"},{"$f":"YD3","v":"Choice #"},{"$f":"YE3","v":"Proposes to"},{"$f":"YF3","v":"Ranking"},{"$f":"YG3","v":"Relative Ranking"},{"$f":"YH3","v":"Decision"},null,{"$f":"YJ3","v":"Graduate"},{"$f":"YK3","v":"Choice #"},{"$f":"YL3","v":"Proposes to"},{"$f":"YM3","v":"Ranking"},{"$f":"YN3","v":"Relative Ranking"},{"$f":"YO3","v":"Decision"},null,{"$f":"YQ3","v":"Graduate"},{"$f":"YR3","v":"Choice #"},{"$f":"YS3","v":"Proposes to"},{"$f":"YT3","v":"Ranking"},{"$f":"YU3","v":"Relative Ranking"},{"$f":"YV3","v":"Decision"},null,{"$f":"YX3","v":"Graduate"},{"$f":"YY3","v":"Choice #"},{"$f":"YZ3","v":"Proposes to"},{"$f":"ZA3","v":"Ranking"},{"$f":"ZB3","v":"Relative Ranking"},{"$f":"ZC3","v":"Decision"},null,{"$f":"ZE3","v":"Graduate"},{"$f":"ZF3","v":"Choice #"},{"$f":"ZG3","v":"Proposes to"},{"$f":"ZH3","v":"Ranking"},{"$f":"ZI3","v":"Relative Ranking"},{"$f":"ZJ3","v":"Decision"},null,{"$f":"ZL3","v":"Graduate"},{"$f":"ZM3","v":"Choice #"},{"$f":"ZN3","v":"Proposes to"},{"$f":"ZO3","v":"Ranking"},{"$f":"ZP3","v":"Relative Ranking"},{"$f":"ZQ3","v":"Decision"},null,{"$f":"ZS3","v":"Graduate"},{"$f":"ZT3","v":"Choice #"},{"$f":"ZU3","v":"Proposes to"},{"$f":"ZV3","v":"Ranking"},{"$f":"ZW3","v":"Relative Ranking"},{"$f":"ZX3","v":"Decision"},null,{"$f":"ZZ3","v":"Graduate"},{"$f":"AAA3","v":"Choice #"},{"$f":"AAB3","v":"Proposes to"},{"$f":"AAC3","v":"Ranking"},{"$f":"AAD3","v":"Relative Ranking"},{"$f":"AAE3","v":"Decision"},null,{"$f":"AAG3","v":"Graduate"},{"$f":"AAH3","v":"Choice #"},{"$f":"AAI3","v":"Proposes to"},{"$f":"AAJ3","v":"Ranking"},{"$f":"AAK3","v":"Relative Ranking"},{"$f":"AAL3","v":"Decision"},null,{"$f":"AAN3","v":"Graduate"},{"$f":"AAO3","v":"Choice #"},{"$f":"AAP3","v":"Proposes to"},{"$f":"AAQ3","v":"Ranking"},{"$f":"AAR3","v":"Relative Ranking"},{"$f":"AAS3","v":"Decision"},null,{"$f":"AAU3","v":"Graduate"},{"$f":"AAV3","v":"Choice #"},{"$f":"AAW3","v":"Proposes to"},{"$f":"AAX3","v":"Ranking"},{"$f":"AAY3","v":"Relative Ranking"},{"$f":"AAZ3","v":"Decision"},null,{"$f":"ABB3","v":"Graduate"},{"$f":"ABC3","v":"Choice #"},{"$f":"ABD3","v":"Proposes to"},{"$f":"ABE3","v":"Ranking"},{"$f":"ABF3","v":"Relative Ranking"},{"$f":"ABG3","v":"Decision"},null,{"$f":"ABI3","v":"Graduate"},{"$f":"ABJ3","v":"Choice #"},{"$f":"ABK3","v":"Proposes to"},{"$f":"ABL3","v":"Ranking"},{"$f":"ABM3","v":"Relative Ranking"},{"$f":"ABN3","v":"Decision"},null,{"$f":"ABP3","v":"Graduate"},{"$f":"ABQ3","v":"Choice #"},{"$f":"ABR3","v":"Proposes to"},{"$f":"ABS3","v":"Ranking"},{"$f":"ABT3","v":"Relative Ranking"},{"$f":"ABU3","v":"Decision"},null,{"$f":"ABW3","v":"Graduate"},{"$f":"ABX3","v":"Choice #"},{"$f":"ABY3","v":"Proposes to"},{"$f":"ABZ3","v":"Ranking"},{"$f":"ACA3","v":"Relative Ranking"},{"$f":"ACB3","v":"Decision"},null,{"$f":"ACD3","v":"Graduate"},{"$f":"ACE3","v":"Choice #"},{"$f":"ACF3","v":"Proposes to"},{"$f":"ACG3","v":"Ranking"},{"$f":"ACH3","v":"Relative Ranking"},{"$f":"ACI3","v":"Decision"},null,{"$f":"ACK3","v":"Graduate"},{"$f":"ACL3","v":"Choice #"},{"$f":"ACM3","v":"Proposes to"},{"$f":"ACN3","v":"Ranking"},{"$f":"ACO3","v":"Relative Ranking"},{"$f":"ACP3","v":"Decision"},null,{"$f":"ACR3","v":"Graduate"},{"$f":"ACS3","v":"Choice #"},{"$f":"ACT3","v":"Proposes to"},{"$f":"ACU3","v":"Ranking"},{"$f":"ACV3","v":"Relative Ranking"},{"$f":"ACW3","v":"Decision"},null,{"$f":"ACY3","v":"Graduate"},{"$f":"ACZ3","v":"Choice #"},{"$f":"ADA3","v":"Proposes to"},{"$f":"ADB3","v":"Ranking"},{"$f":"ADC3","v":"Relative Ranking"},{"$f":"ADD3","v":"Decision"},null,{"$f":"ADF3","v":"Graduate"},{"$f":"ADG3","v":"Choice #"},{"$f":"ADH3","v":"Proposes to"},{"$f":"ADI3","v":"Ranking"},{"$f":"ADJ3","v":"Relative Ranking"},{"$f":"ADK3","v":"Decision"},null,{"$f":"ADM3","v":"Graduate"},{"$f":"ADN3","v":"Choice #"},{"$f":"ADO3","v":"Proposes to"},{"$f":"ADP3","v":"Ranking"},{"$f":"ADQ3","v":"Relative Ranking"},{"$f":"ADR3","v":"Decision"},null,{"$f":"ADT3","v":"Graduate"},{"$f":"ADU3","v":"Choice #"},{"$f":"ADV3","v":"Proposes to"},{"$f":"ADW3","v":"Ranking"},{"$f":"ADX3","v":"Relative Ranking"},{"$f":"ADY3","v":"Decision"},null,{"$f":"AEA3","v":"Graduate"},{"$f":"AEB3","v":"Choice #"},{"$f":"AEC3","v":"Proposes to"},{"$f":"AED3","v":"Ranking"},{"$f":"AEE3","v":"Relative Ranking"},{"$f":"AEF3","v":"Decision"},null,{"$f":"AEH3","v":"Graduate"},{"$f":"AEI3","v":"Choice #"},{"$f":"AEJ3","v":"Proposes to"},{"$f":"AEK3","v":"Ranking"},{"$f":"AEL3","v":"Relative Ranking"},{"$f":"AEM3","v":"Decision"},null,{"$f":"AEO3","v":"Graduate"},{"$f":"AEP3","v":"Choice #"},{"$f":"AEQ3","v":"Proposes to"},{"$f":"AER3","v":"Ranking"},{"$f":"AES3","v":"Relative Ranking"},{"$f":"AET3","v":"Decision"},null,{"$f":"AEV3","v":"Graduate"},{"$f":"AEW3","v":"Choice #"},{"$f":"AEX3","v":"Proposes to"},{"$f":"AEY3","v":"Ranking"},{"$f":"AEZ3","v":"Relative Ranking"},{"$f":"AFA3","v":"Decision"},null,{"$f":"AFC3","v":"Graduate"},{"$f":"AFD3","v":"Choice #"},{"$f":"AFE3","v":"Proposes to"},{"$f":"AFF3","v":"Ranking"},{"$f":"AFG3","v":"Relative Ranking"},{"$f":"AFH3","v":"Decision"},null,{"$f":"AFJ3","v":"Graduate"},{"$f":"AFK3","v":"Choice #"},{"$f":"AFL3","v":"Proposes to"},{"$f":"AFM3","v":"Ranking"},{"$f":"AFN3","v":"Relative Ranking"},{"$f":"AFO3","v":"Decision"},null,{"$f":"AFQ3","v":"Graduate"},{"$f":"AFR3","v":"Choice #"},{"$f":"AFS3","v":"Proposes to"},{"$f":"AFT3","v":"Ranking"},{"$f":"AFU3","v":"Relative Ranking"},{"$f":"AFV3","v":"Decision"},null,{"$f":"AFX3","v":"Graduate"},{"$f":"AFY3","v":"Choice #"},{"$f":"AFZ3","v":"Proposes to"},{"$f":"AGA3","v":"Ranking"},{"$f":"AGB3","v":"Relative Ranking"},{"$f":"AGC3","v":"Decision"},null,{"$f":"AGE3","v":"Graduate"},{"$f":"AGF3","v":"Choice #"},{"$f":"AGG3","v":"Proposes to"},{"$f":"AGH3","v":"Ranking"},{"$f":"AGI3","v":"Relative Ranking"},{"$f":"AGJ3","v":"Decision"},null,{"$f":"AGL3","v":"Graduate"},{"$f":"AGM3","v":"Choice #"},{"$f":"AGN3","v":"Proposes to"},{"$f":"AGO3","v":"Ranking"},{"$f":"AGP3","v":"Relative Ranking"},{"$f":"AGQ3","v":"Decision"},null,{"$f":"AGS3","v":"Graduate"},{"$f":"AGT3","v":"Choice #"},{"$f":"AGU3","v":"Proposes to"},{"$f":"AGV3","v":"Ranking"},{"$f":"AGW3","v":"Relative Ranking"},{"$f":"AGX3","v":"Decision"},null,{"$f":"AGZ3","v":"Graduate"},{"$f":"AHA3","v":"Choice #"},{"$f":"AHB3","v":"Proposes to"},{"$f":"AHC3","v":"Ranking"},{"$f":"AHD3","v":"Relative Ranking"},{"$f":"AHE3","v":"Decision"},null,{"$f":"AHG3","v":"Graduate"},{"$f":"AHH3","v":"Choice #"},{"$f":"AHI3","v":"Proposes to"},{"$f":"AHJ3","v":"Ranking"},{"$f":"AHK3","v":"Relative Ranking"},{"$f":"AHL3","v":"Decision"}]
[1,"Alvin",1,"Finance",5,1,"Accepted",null,"Alvin",1,"Finance",5,3,"Accepted",null,"Alvin",1,"Finance",5,3,"Accepted",null,"Alvin",1,"Finance",5,3,"Accepted",null,"Alvin",1,"Finance",5,3,"Accepted"]
[1,"Bob",1,"Jedi",6,1,"Accepted",null,"Bob",1,"Jedi",6,1,"Accepted",null,"Bob",1,"Jedi",6,1,"Accepted",null,"Bob",1,"Jedi",6,1,"Accepted",null,"Bob",1,"Jedi",6,1,"Accepted"]
[2,"Chelsea",1,"Jedi",8,2,"Rejected",null,"Chelsea",2,"Finance",22,5,"Accepted",null,"Chelsea",2,"Finance",22,5,"Accepted",null,"Chelsea",2,"Finance",22,5,"Accepted",null,"Chelsea",2,"Finance",22,5,"Accepted"]
[1,"Daniel",1,"Economics",5,1,"Accepted",null,"Daniel",1,"Economics",5,1,"Accepted",null,"Daniel",1,"Economics",5,1,"Accepted",null,"Daniel",1,"Economics",5,2,"Accepted",null,"Daniel",1,"Economics",5,2,"Accepted"]
[2,"Emily",1,"Jedi",17,4,"Rejected",null,"Emily",2,"Economics",18,4,"Accepted",null,"Emily",2,"Economics",18,4,"Accepted",null,"Emily",2,"Economics",18,5,"Accepted",null,"Emily",2,"Economics",18,5,"Accepted"]
[3,"Frank",1,"Marketing",20,6,"Rejected",null,"Frank",2,"Jedi",26,2,"Rejected",null,"Frank",3,"Research",6,1,"Accepted",null,"Frank",3,"Research",6,1,"Accepted",null,"Frank",3,"Research",6,1,"Accepted"]
[1,"Geraldine",1,"Research",11,1,"Accepted",null,"Geraldine",1,"Research",11,1,"Accepted",null,"Geraldine",1,"Research",11,2,"Accepted",null,"Geraldine",1,"Research",11,2,"Accepted",null,"Geraldine",1,"Research",11,2,"Accepted"]
[1,"Haley",1,"Law",24,2,"Accepted",null,"Haley",1,"Law",24,2,"Accepted",null,"Haley",1,"Law",24,2,"Accepted",null,"Haley",1,"Law",24,2,"Accepted",null,"Haley",1,"Law",24,3,"Accepted"]
[2,"Ian",1,"Finance",25,3,"Accepted",null,"Ian",1,"Finance",25,7,"Rejected",null,"Ian",2,"Marketing",4,1,"Accepted",null,"Ian",2,"Marketing",4,1,"Accepted",null,"Ian",2,"Marketing",4,1,"Accepted"]
[1,"Jeffrey",1,"Finance",24,2,"Accepted",null,"Jeffrey",1,"Finance",24,6,"Accepted",null,"Jeffrey",1,"Finance",24,6,"Accepted",null,"Jeffrey",1,"Finance",24,6,"Accepted",null,"Jeffrey",1,"Finance",24,6,"Accepted"]
[1,"Kevin",1,"Economics",10,3,"Accepted",null,"Kevin",1,"Economics",10,3,"Accepted",null,"Kevin",1,"Economics",10,3,"Accepted",null,"Kevin",1,"Economics",10,4,"Accepted",null,"Kevin",1,"Economics",10,4,"Accepted"]
[1,"Leia",1,"Research",21,2,"Accepted",null,"Leia",1,"Research",21,3,"Accepted",null,"Leia",1,"Research",21,4,"Accepted",null,"Leia",1,"Research",21,4,"Accepted",null,"Leia",1,"Research",21,4,"Accepted"]
[1,"Macey",1,"Budget",4,1,"Accepted",null,"Macey",1,"Budget",4,1,"Accepted",null,"Macey",1,"Budget",4,1,"Accepted",null,"Macey",1,"Budget",4,1,"Accepted",null,"Macey",1,"Budget",4,1,"Accepted"]
[1,"Natalie",1,"Budget",17,3,"Accepted",null,"Natalie",1,"Budget",17,3,"Accepted",null,"Natalie",1,"Budget",17,3,"Accepted",null,"Natalie",1,"Budget",17,3,"Accepted",null,"Natalie",1,"Budget",17,3,"Accepted"]
[1,"Oliver",1,"Budget",7,2,"Accepted",null,"Oliver",1,"Budget",7,2,"Accepted",null,"Oliver",1,"Budget",7,2,"Accepted",null,"Oliver",1,"Budget",7,2,"Accepted",null,"Oliver",1,"Budget",7,2,"Accepted"]
[2,"Phoebe",1,"Marketing",16,5,"Rejected",null,"Phoebe",2,"Research",13,2,"Accepted",null,"Phoebe",2,"Research",13,3,"Accepted",null,"Phoebe",2,"Research",13,3,"Accepted",null,"Phoebe",2,"Research",13,3,"Accepted"]
[1,"Quentin",1,"Marketing",6,1,"Accepted",null,"Quentin",1,"Marketing",6,1,"Accepted",null,"Quentin",1,"Marketing",6,2,"Accepted",null,"Quentin",1,"Marketing",6,2,"Accepted",null,"Quentin",1,"Marketing",6,2,"Accepted"]
[2,"Rachael",1,"Jedi",19,5,"Rejected",null,"Rachael",2,"Finance",4,2,"Accepted",null,"Rachael",2,"Finance",4,2,"Accepted",null,"Rachael",2,"Finance",4,2,"Accepted",null,"Rachael",2,"Finance",4,2,"Accepted"]
[2,"Stuart",1,"Marketing",11,4,"Rejected",null,"Stuart",2,"Finance",2,1,"Accepted",null,"Stuart",2,"Finance",2,1,"Accepted",null,"Stuart",2,"Finance",2,1,"Accepted",null,"Stuart",2,"Finance",2,1,"Accepted"]
[2,"Theodore",1,"Marketing",9,3,"Accepted",null,"Theodore",1,"Marketing",9,3,"Accepted",null,"Theodore",1,"Marketing",9,4,"Rejected",null,"Theodore",2,"Economics",1,1,"Accepted",null,"Theodore",2,"Economics",1,1,"Accepted"]
[1,"Ursula",1,"Marketing",8,2,"Accepted",null,"Ursula",1,"Marketing",8,2,"Accepted",null,"Ursula",1,"Marketing",8,3,"Accepted",null,"Ursula",1,"Marketing",8,3,"Accepted",null,"Ursula",1,"Marketing",8,3,"Accepted"]
[3,"Victor",1,"Research",23,3,"Accepted",null,"Victor",1,"Research",23,4,"Accepted",null,"Victor",1,"Research",23,5,"Rejected",null,"Victor",2,"Marketing",21,4,"Rejected",null,"Victor",3,"Law",1,1,"Accepted"]
[1,"Wendy",1,"Economics",6,2,"Accepted",null,"Wendy",1,"Economics",6,2,"Accepted",null,"Wendy",1,"Economics",6,2,"Accepted",null,"Wendy",1,"Economics",6,3,"Accepted",null,"Wendy",1,"Economics",6,3,"Accepted"]
[1,"Xavier",1,"Law",7,1,"Accepted",null,"Xavier",1,"Law",7,1,"Accepted",null,"Xavier",1,"Law",7,1,"Accepted",null,"Xavier",1,"Law",7,1,"Accepted",null,"Xavier",1,"Law",7,2,"Accepted"]
[2,"Yasmin",1,"Jedi",9,3,"Rejected",null,"Yasmin",2,"Finance",9,4,"Accepted",null,"Yasmin",2,"Finance",9,4,"Accepted",null,"Yasmin",2,"Finance",9,4,"Accepted",null,"Yasmin",2,"Finance",9,4,"Accepted"]
[2,"Zelda",1,"Research",24,4,"Accepted",null,"Zelda",1,"Research",24,5,"Rejected",null,"Zelda",2,"Budget",20,4,"Accepted",null,"Zelda",2,"Budget",20,4,"Accepted",null,"Zelda",2,"Budget",20,4,"Accepted"]

{"sheet":"Work","index":5,"n_rows":1182,"n_cols":1005,"rows_kept":1182,"cut":false,"hidden":false,"merged":[]}
[1,2,3,4,5,6,7,8,9,10,11,12,13,14,15,16,17,18,19,20,21,22,23,24,25,26,27,28,29,30,31,32,33,34,35,36,37,38,39,40,41,42,43,44,45,46,47,48,49,50,51,52,53,54,55,56,57,58,59,60,61,62,63,64,65,66,67,68,69,70,71,72,73,74,75,76,77,78,79,80,81,82,83,84,85,86,87,88,89,90,91,92,93,94,95,96,97,98,99,100,101,102,103,104,105,106,107,108,109,110,111,112,113,114,115,116,117,118,119,120,121,122,123,124,125,126,127,128,129,130,131,132,133,134,135,136,137,138,139,140,141,142,143,144,145,146,147,148,149,150,151,152,153,154,155,156,157,158,159,160,161,162,163,164,165,166,167,168,169,170,171,172,173,174,175,176,177,178,179,180,181,182,183,184,185,186,187,188,189,190,191,192,193,194,195,196,197,198,199,200,201,202,203,204,205,206,207,208,209,210,211,212,213,214,215,216,217,218,219,220,221,222,223,224,225,226,227,228,229,230,231,232,233,234,235,236,237,238,239,240,241,242,243,244,245,246,247,248,249,250,251,252,253,254,255,256,257,258,259,260,261,262,263,264,265,266,267,268,269,270,271,272,273,274,275,276,277,278,279,280,281,282,283,284,285,286,287,288,289,290,291,292,293,294,295,296,297,298,299,300,301,302,303,304,305,306,307,308,309,310,311,312,313,314,315,316,317,318,319,320,321,322,323,324,325,326,327,328,329,330,331,332,333,334,335,336,337,338,339,340,341,342,343,344,345,346,347,348,349,350,351,352,353,354,355,356,357,358,359,360,361,362,363,364,365,366,367,368,369,370,371,372,373,374,375,376,377,378,379,380,381,382,383,384,385,386,387,388,389,390,391,392,393,394,395,396,397,398,399,400,401,402,403,404,405,406,407,408,409,410,411,412,413,414,415,416,417,418,419,420,421,422,423,424,425,426,427,428,429,430,431,432,433,434,435,436,437,438,439,440,441,442,443,444,445,446,447,448,449,450,451,452,453,454,455,456,457,458,459,460,461,462,463,464,465,466,467,468,469,470,471,472,473,474,475,476,477,478,479,480,481,482,483,484,485,486,487,488,489,490,491,492,493,494,495,496,497,498,499,500,501,502,503,504,505,506,507,508,509,510,511,512,513,514,515,516,517,518,519,520,521,522,523,524,525,526,527,528,529,530,531,532,533,534,535,536,537,538,539,540,541,542,543,544,545,546,547,548,549,550,551,552,553,554,555,556,557,558,559,560,561,562,563,564,565,566,567,568,569,570,571,572,573,574,575,576,577,578,579,580,581,582,583,584,585,586,587,588,589,590,591,592,593,594,595,596,597,598,599,600,601,602,603,604,605,606,607,608,609,610,611,612,613,614,615,616,617,618,619,620,621,622,623,624,625,626,627,628,629,630,631,632,633,634,635,636,637,638,639,640,641,642,643,644,645,646,647,648,649,650,651,652,653,654,655,656,657,658,659,660,661,662,663,664,665,666,667,668,669,670,671,672,673,674,675,676,677,678,679,680,681,682,683,684,685,686,687,688,689,690,691,692,693,694,695,696,697,698,699,700,701,702,703,704,705,706,707,708,709,710,711,712,713,714,715,716,717,718,719,720,721,722,723,724,725,726,727,728,729,730,731,732,733,734,735,736,737,738,739,740,741,742,743,744,745,746,747,748,749,750,751,752,753,754,755,756,757,758,759,760,761,762,763,764,765,766,767,768,769,770,771,772,773,774,775,776,777,778,779,780,781,782,783,784,785,786,787,788,789,790,791,792,793,794,795,796,797,798,799,800,801,802,803,804,805,806,807,808,809,810,811,812,813,814,815,816,817,818,819,820,821,822,823,824,825,826,827,828,829,830,831,832,833,834,835,836,837,838,839,840,841,842,843,844,845,846,847,848,849,850,851,852,853,854,855,856,857,858,859,860,861,862,863,864,865,866,867,868,869,870,871,872,873,874,875,876,877,878,879,880,881,882,883,884,885,886,887,888,889,890,891,892,893,894,895,896,897,898,899,900,901,902,903,904,905,906,907,908,909,910,911,912,913,914,915,916,917,918,919,920,921,922,923,924,925,926,927,928,929,930,931,932,933,934,935,936,937,938,939,940,941,942,943,944,945,946,947,948,949,950,951,952,953,954,955,956,957,958,959,960,961,962,963,964,965,966,967,968,969,970,971,972,973,974,975,976,977,978,979,980,981,982,983,984,985,986,987,988,989,990,991,992,993,994,995,996,997,998,999,1000,1001,1002,1003,1004,1005]
[null,null,null,null,null,"Research",null,null,"max capacity",{"$f":"MAX('Division Preferences'!B5:ZZ5)","v":6},null,{"$f":"COUNTIFS(H$4:H$1000,\">0\")","v":4},"# of matches"]
["#","Grad.","Pref.","Check","Pos.","Rank","RR Inv","Rel. Rank","Proposes to","Complete Ranking",null,"List of Matches"]
[1,{"$f":"IF(A4<=NGrad,'Graduate Preferences'!A5,\"\")","v":"Alvin"},{"$f":"IF(A4<=NGrad,Process!A4,\"\")","v":1},{"$f":"IF(A4<=NGrad,COUNTIFS('Graduate Preferences'!B5:ZZ5,C4),\"\")","v":1},{"$f":"IF(A4<=NGrad,IF(D4=0,0,MATCH(C4,'Graduate Preferences'!B5:ZZ5,0)),\"\")","v":1},{"$f":"IF(AND(J4<>\"-\",J4>0,I4=F$2),J4,\"\")","v":""},{"$f":"IF(F4=\"\",\"\",RANK(F4,F$4:F$1000))","v":""},{"$f":"IF(F4=\"\",\"\",MAX(G$4:G$1000)-G4+1)","v":""},"Finance",5,null,{"$f":"IF(MAX(H$4:H$1000)>=A4,MATCH(A4,H$4:H$1000,0),\"\")","v":6}]
[2,{"$f":"IF(A5<=NGrad,'Graduate Preferences'!A6,\"\")","v":"Bob"},{"$f":"IF(A5<=NGrad,Process!A5,\"\")","v":1},{"$f":"IF(A5<=NGrad,COUNTIFS('Graduate Preferences'!B6:ZZ6,C5),\"\")","v":1},{"$f":"IF(A5<=NGrad,IF(D5=0,0,MATCH(C5,'Graduate Preferences'!B6:ZZ6,0)),\"\")","v":4},{"$f":"IF(AND(J5<>\"-\",J5>0,I5=F$2),J5,\"\")","v":""},{"$f":"IF(F5=\"\",\"\",RANK(F5,F$4:F$1000))","v":""},{"$f":"IF(F5=\"\",\"\",MAX(G$4:G$1000)-G5+1)","v":""},"Jedi",6,null,{"$f":"IF(MAX(H$4:H$1000)>=A5,MATCH(A5,H$4:H$1000,0),\"\")","v":7}]
[3,{"$f":"IF(A6<=NGrad,'Graduate Preferences'!A7,\"\")","v":"Chelsea"},{"$f":"IF(A6<=NGrad,Process!A6,\"\")","v":2},{"$f":"IF(A6<=NGrad,COUNTIFS('Graduate Preferences'!B7:ZZ7,C6),\"\")","v":1},{"$f":"IF(A6<=NGrad,IF(D6=0,0,MATCH(C6,'Graduate Preferences'!B7:ZZ7,0)),\"\")","v":1},"","","","Finance",22,null,16]
[4,{"$f":"IF(A7<=NGrad,'Graduate Preferences'!A8,\"\")","v":"Daniel"},{"$f":"IF(A7<=NGrad,Process!A7,\"\")","v":1},{"$f":"IF(A7<=NGrad,COUNTIFS('Graduate Preferences'!B8:ZZ8,C7),\"\")","v":1},{"$f":"IF(A7<=NGrad,IF(D7=0,0,MATCH(C7,'Graduate Preferences'!B8:ZZ8,0)),\"\")","v":5},"","","","Economics",5,null,12]
[5,{"$f":"IF(A8<=NGrad,'Graduate Preferences'!A9,\"\")","v":"Emily"},{"$f":"IF(A8<=NGrad,Process!A8,\"\")","v":2},{"$f":"IF(A8<=NGrad,COUNTIFS('Graduate Preferences'!B9:ZZ9,C8),\"\")","v":1},{"$f":"IF(A8<=NGrad,IF(D8=0,0,MATCH(C8,'Graduate Preferences'!B9:ZZ9,0)),\"\")","v":5},"","","","Economics",18,null,""]
[6,{"$f":"IF(A9<=NGrad,'Graduate Preferences'!A10,\"\")","v":"Frank"},{"$f":"IF(A9<=NGrad,Process!A9,\"\")","v":3},{"$f":"IF(A9<=NGrad,COUNTIFS('Graduate Preferences'!B10:ZZ10,C9),\"\")","v":1},{"$f":"IF(A9<=NGrad,IF(D9=0,0,MATCH(C9,'Graduate Preferences'!B10:ZZ10,0)),\"\")","v":7},6,4,1,"Research",6,null,""]
[7,{"$f":"IF(A10<=NGrad,'Graduate Preferences'!A11,\"\")","v":"Geraldine"},{"$f":"IF(A10<=NGrad,Process!A10,\"\")","v":1},{"$f":"IF(A10<=NGrad,COUNTIFS('Graduate Preferences'!B11:ZZ11,C10),\"\")","v":1},{"$f":"IF(A10<=NGrad,IF(D10=0,0,MATCH(C10,'Graduate Preferences'!B11:ZZ11,0)),\"\")","v":7},11,3,2,"Research",11,null,""]
[8,{"$f":"IF(A11<=NGrad,'Graduate Preferences'!A12,\"\")","v":"Haley"},{"$f":"IF(A11<=NGrad,Process!A11,\"\")","v":1},{"$f":"IF(A11<=NGrad,COUNTIFS('Graduate Preferences'!B12:ZZ12,C11),\"\")","v":1},{"$f":"IF(A11<=NGrad,IF(D11=0,0,MATCH(C11,'Graduate Preferences'!B12:ZZ12,0)),\"\")","v":3},"","","","Law",24,null,""]
[9,{"$f":"IF(A12<=NGrad,'Graduate Preferences'!A13,\"\")","v":"Ian"},{"$f":"IF(A12<=NGrad,Process!A12,\"\")","v":2},{"$f":"IF(A12<=NGrad,COUNTIFS('Graduate Preferences'!B13:ZZ13,C12),\"\")","v":1},{"$f":"IF(A12<=NGrad,IF(D12=0,0,MATCH(C12,'Graduate Preferences'!B13:ZZ13,0)),\"\")","v":2},"","","","Marketing",4,null,""]
[10,{"$f":"IF(A13<=NGrad,'Graduate Preferences'!A14,\"\")","v":"Jeffrey"},{"$f":"IF(A13<=NGrad,Process!A13,\"\")","v":1},{"$f":"IF(A13<=NGrad,COUNTIFS('Graduate Preferences'!B14:ZZ14,C13),\"\")","v":1},{"$f":"IF(A13<=NGrad,IF(D13=0,0,MATCH(C13,'Graduate Preferences'!B14:ZZ14,0)),\"\")","v":1},"","","","Finance",24,null,""]
[11,{"$f":"IF(A14<=NGrad,'Graduate Preferences'!A15,\"\")","v":"Kevin"},{"$f":"IF(A14<=NGrad,Process!A14,\"\")","v":1},{"$f":"IF(A14<=NGrad,COUNTIFS('Graduate Preferences'!B15:ZZ15,C14),\"\")","v":1},{"$f":"IF(A14<=NGrad,IF(D14=0,0,MATCH(C14,'Graduate Preferences'!B15:ZZ15,0)),\"\")","v":5},"","","","Economics",10,null,""]
[12,{"$f":"IF(A15<=NGrad,'Graduate Preferences'!A16,\"\")","v":"Leia"},{"$f":"IF(A15<=NGrad,Process!A15,\"\")","v":1},{"$f":"IF(A15<=NGrad,COUNTIFS('Graduate Preferences'!B16:ZZ16,C15),\"\")","v":1},{"$f":"IF(A15<=NGrad,IF(D15=0,0,MATCH(C15,'Graduate Preferences'!B16:ZZ16,0)),\"\")","v":7},21,1,4,"Research",21,null,""]
[13,{"$f":"IF(A16<=NGrad,'Graduate Preferences'!A17,\"\")","v":"Macey"},{"$f":"IF(A16<=NGrad,Process!A16,\"\")","v":1},{"$f":"IF(A16<=NGrad,COUNTIFS('Graduate Preferences'!B17:ZZ17,C16),\"\")","v":1},{"$f":"IF(A16<=NGrad,IF(D16=0,0,MATCH(C16,'Graduate Preferences'!B17:ZZ17,0)),\"\")","v":6},"","","","Budget",4,null,""]
[14,{"$f":"IF(A17<=NGrad,'Graduate Preferences'!A18,\"\")","v":"Natalie"},{"$f":"IF(A17<=NGrad,Process!A17,\"\")","v":1},{"$f":"IF(A17<=NGrad,COUNTIFS('Graduate Preferences'!B18:ZZ18,C17),\"\")","v":1},{"$f":"IF(A17<=NGrad,IF(D17=0,0,MATCH(C17,'Graduate Preferences'!B18:ZZ18,0)),\"\")","v":6},"","","","Budget",17,null,""]
[15,{"$f":"IF(A18<=NGrad,'Graduate Preferences'!A19,\"\")","v":"Oliver"},{"$f":"IF(A18<=NGrad,Process!A18,\"\")","v":1},{"$f":"IF(A18<=NGrad,COUNTIFS('Graduate Preferences'!B19:ZZ19,C18),\"\")","v":1},{"$f":"IF(A18<=NGrad,IF(D18=0,0,MATCH(C18,'Graduate Preferences'!B19:ZZ19,0)),\"\")","v":6},{"$f":"IF(AND(J18<>\"-\",J18>0,I18=F$2),J18,\"\")","v":""},{"$f":"IF(F18=\"\",\"\",RANK(F18,F$4:F$1000))","v":""},{"$f":"IF(F18=\"\",\"\",MAX(G$4:G$1000)-G18+1)","v":""},"Budget",7,null,""]
[16,{"$f":"IF(A19<=NGrad,'Graduate Preferences'!A20,\"\")","v":"Phoebe"},{"$f":"IF(A19<=NGrad,Process!A19,\"\")","v":2},{"$f":"IF(A19<=NGrad,COUNTIFS('Graduate Preferences'!B20:ZZ20,C19),\"\")","v":1},{"$f":"IF(A19<=NGrad,IF(D19=0,0,MATCH(C19,'Graduate Preferences'!B20:ZZ20,0)),\"\")","v":7},{"$f":"IF(AND(J19<>\"-\",J19>0,I19=F$2),J19,\"\")","v":13},2,{"$f":"IF(F19=\"\",\"\",MAX(G$4:G$1000)-G19+1)","v":3},"Research",13,null,""]
[17,{"$f":"IF(A20<=NGrad,'Graduate Preferences'!A21,\"\")","v":"Quentin"},{"$f":"IF(A20<=NGrad,Process!A20,\"\")","v":1},{"$f":"IF(A20<=NGrad,COUNTIFS('Graduate Preferences'!B21:ZZ21,C20),\"\")","v":1},{"$f":"IF(A20<=NGrad,IF(D20=0,0,MATCH(C20,'Graduate Preferences'!B21:ZZ21,0)),\"\")","v":2},{"$f":"IF(AND(J20<>\"-\",J20>0,I20=F$2),J20,\"\")","v":""},{"$f":"IF(F20=\"\",\"\",RANK(F20,F$4:F$1000))","v":""},{"$f":"IF(F20=\"\",\"\",MAX(G$4:G$1000)-G20+1)","v":""},"Marketing",6,null,""]
[18,{"$f":"IF(A21<=NGrad,'Graduate Preferences'!A22,\"\")","v":"Rachael"},{"$f":"IF(A21<=NGrad,Process!A21,\"\")","v":2},{"$f":"IF(A21<=NGrad,COUNTIFS('Graduate Preferences'!B22:ZZ22,C21),\"\")","v":1},{"$f":"IF(A21<=NGrad,IF(D21=0,0,MATCH(C21,'Graduate Preferences'!B22:ZZ22,0)),\"\")","v":1},{"$f":"IF(AND(J21<>\"-\",J21>0,I21=F$2),J21,\"\")","v":""},"",{"$f":"IF(F21=\"\",\"\",MAX(G$4:G$1000)-G21+1)","v":""},"Finance",4,null,""]
[19,{"$f":"IF(A22<=NGrad,'Graduate Preferences'!A23,\"\")","v":"Stuart"},{"$f":"IF(A22<=NGrad,Process!A22,\"\")","v":2},{"$f":"IF(A22<=NGrad,COUNTIFS('Graduate Preferences'!B23:ZZ23,C22),\"\")","v":1},{"$f":"IF(A22<=NGrad,IF(D22=0,0,MATCH(C22,'Graduate Preferences'!B23:ZZ23,0)),\"\")","v":1},"","","","Finance",2,null,""]
[20,{"$f":"IF(A23<=NGrad,'Graduate Preferences'!A24,\"\")","v":"Theodore"},{"$f":"IF(A23<=NGrad,Process!A23,\"\")","v":2},{"$f":"IF(A23<=NGrad,COUNTIFS('Graduate Preferences'!B24:ZZ24,C23),\"\")","v":1},{"$f":"IF(A23<=NGrad,IF(D23=0,0,MATCH(C23,'Graduate Preferences'!B24:ZZ24,0)),\"\")","v":5},{"$f":"IF(AND(J23<>\"-\",J23>0,I23=F$2),J23,\"\")","v":""},{"$f":"IF(F23=\"\",\"\",RANK(F23,F$4:F$1000))","v":""},{"$f":"IF(F23=\"\",\"\",MAX(G$4:G$1000)-G23+1)","v":""},"Economics",1,null,""]
[21,{"$f":"IF(A24<=NGrad,'Graduate Preferences'!A25,\"\")","v":"Ursula"},{"$f":"IF(A24<=NGrad,Process!A24,\"\")","v":1},{"$f":"IF(A24<=NGrad,COUNTIFS('Graduate Preferences'!B25:ZZ25,C24),\"\")","v":1},{"$f":"IF(A24<=NGrad,IF(D24=0,0,MATCH(C24,'Graduate Preferences'!B25:ZZ25,0)),\"\")","v":2},{"$f":"IF(AND(J24<>\"-\",J24>0,I24=F$2),J24,\"\")","v":""},"",{"$f":"IF(F24=\"\",\"\",MAX(G$4:G$1000)-G24+1)","v":""},"Marketing",8,null,""]
[22,{"$f":"IF(A25<=NGrad,'Graduate Preferences'!A26,\"\")","v":"Victor"},{"$f":"IF(A25<=NGrad,Process!A25,\"\")","v":3},{"$f":"IF(A25<=NGrad,COUNTIFS('Graduate Preferences'!B26:ZZ26,C25),\"\")","v":1},{"$f":"IF(A25<=NGrad,IF(D25=0,0,MATCH(C25,'Graduate Preferences'!B26:ZZ26,0)),\"\")","v":3},"","","","Law",1,null,""]
[23,{"$f":"IF(A26<=NGrad,'Graduate Preferences'!A27,\"\")","v":"Wendy"},{"$f":"IF(A26<=NGrad,Process!A26,\"\")","v":1},{"$f":"IF(A26<=NGrad,COUNTIFS('Graduate Preferences'!B27:ZZ27,C26),\"\")","v":1},{"$f":"IF(A26<=NGrad,IF(D26=0,0,MATCH(C26,'Graduate Preferences'!B27:ZZ27,0)),\"\")","v":5},{"$f":"IF(AND(J26<>\"-\",J26>0,I26=F$2),J26,\"\")","v":""},{"$f":"IF(F26=\"\",\"\",RANK(F26,F$4:F$1000))","v":""},{"$f":"IF(F26=\"\",\"\",MAX(G$4:G$1000)-G26+1)","v":""},"Economics",6,null,""]
[24,{"$f":"IF(A27<=NGrad,'Graduate Preferences'!A28,\"\")","v":"Xavier"},{"$f":"IF(A27<=NGrad,Process!A27,\"\")","v":1},{"$f":"IF(A27<=NGrad,COUNTIFS('Graduate Preferences'!B28:ZZ28,C27),\"\")","v":1},{"$f":"IF(A27<=NGrad,IF(D27=0,0,MATCH(C27,'Graduate Preferences'!B28:ZZ28,0)),\"\")","v":3},{"$f":"IF(AND(J27<>\"-\",J27>0,I27=F$2),J27,\"\")","v":""},"",{"$f":"IF(F27=\"\",\"\",MAX(G$4:G$1000)-G27+1)","v":""},"Law",7,null,""]
[25,{"$f":"IF(A28<=NGrad,'Graduate Preferences'!A29,\"\")","v":"Yasmin"},{"$f":"IF(A28<=NGrad,Process!A28,\"\")","v":2},{"$f":"IF(A28<=NGrad,COUNTIFS('Graduate Preferences'!B29:ZZ29,C28),\"\")","v":1},{"$f":"IF(A28<=NGrad,IF(D28=0,0,MATCH(C28,'Graduate Preferences'!B29:ZZ29,0)),\"\")","v":1},"","","","Finance",9,null,""]
[26,{"$f":"IF(A29<=NGrad,'Graduate Preferences'!A30,\"\")","v":"Zelda"},{"$f":"IF(A29<=NGrad,Process!A29,\"\")","v":2},{"$f":"IF(A29<=NGrad,COUNTIFS('Graduate Preferences'!B30:ZZ30,C29),\"\")","v":1},{"$f":"IF(A29<=NGrad,IF(D29=0,0,MATCH(C29,'Graduate Preferences'!B30:ZZ30,0)),\"\")","v":6},"","","","Budget",20,null,""]
[27,{"$f":"IF(A30<=NGrad,'Graduate Preferences'!A31,\"\")","v":""},{"$f":"IF(A30<=NGrad,Process!A30,\"\")","v":""},{"$f":"IF(A30<=NGrad,COUNTIFS('Graduate Preferences'!B31:ZZ31,C30),\"\")","v":""},{"$f":"IF(A30<=NGrad,IF(D30=0,0,MATCH(C30,'Graduate Preferences'!B31:ZZ31,0)),\"\")","v":""},"","","","LDP",5,null,""]
[28,{"$f":"IF(A31<=NGrad,'Graduate Preferences'!A32,\"\")","v":""},{"$f":"IF(A31<=NGrad,Process!A31,\"\")","v":""},{"$f":"IF(A31<=NGrad,COUNTIFS('Graduate Preferences'!B32:ZZ32,C31),\"\")","v":""},{"$f":"IF(A31<=NGrad,IF(D31=0,0,MATCH(C31,'Graduate Preferences'!B32:ZZ32,0)),\"\")","v":""},"","","","MCD",10,null,""]
[29,{"$f":"IF(A32<=NGrad,'Graduate Preferences'!A33,\"\")","v":""},{"$f":"IF(A32<=NGrad,Process!A32,\"\")","v":""},{"$f":"IF(A32<=NGrad,COUNTIFS('Graduate Preferences'!B33:ZZ33,C32),\"\")","v":""},{"$f":"IF(A32<=NGrad,IF(D32=0,0,MATCH(C32,'Graduate Preferences'!B33:ZZ33,0)),\"\")","v":""},{"$f":"IF(AND(J32<>\"-\",J32>0,I32=F$2),J32,\"\")","v":""},{"$f":"IF(F32=\"\",\"\",RANK(F32,F$4:F$1000))","v":""},{"$f":"IF(F32=\"\",\"\",MAX(G$4:G$1000)-G32+1)","v":""},"CITD",7,null,""]
[30,{"$f":"IF(A33<=NGrad,'Graduate Preferences'!A34,\"\")","v":""},{"$f":"IF(A33<=NGrad,Process!A33,\"\")","v":""},{"$f":"IF(A33<=NGrad,COUNTIFS('Graduate Preferences'!B34:ZZ34,C33),\"\")","v":""},{"$f":"IF(A33<=NGrad,IF(D33=0,0,MATCH(C33,'Graduate Preferences'!B34:ZZ34,0)),\"\")","v":""},{"$f":"IF(AND(J33<>\"-\",J33>0,I33=F$2),J33,\"\")","v":""},"",{"$f":"IF(F33=\"\",\"\",MAX(G$4:G$1000)-G33+1)","v":""},"-","-",null,""]
[31,{"$f":"IF(A34<=NGrad,'Graduate Preferences'!A35,\"\")","v":""},{"$f":"IF(A34<=NGrad,Process!A34,\"\")","v":""},{"$f":"IF(A34<=NGrad,COUNTIFS('Graduate Preferences'!B35:ZZ35,C34),\"\")","v":""},{"$f":"IF(A34<=NGrad,IF(D34=0,0,MATCH(C34,'Graduate Preferences'!B35:ZZ35,0)),\"\")","v":""},"","","","-","-",null,""]
[32,{"$f":"IF(A35<=NGrad,'Graduate Preferences'!A36,\"\")","v":""},{"$f":"IF(A35<=NGrad,Process!A35,\"\")","v":""},{"$f":"IF(A35<=NGrad,COUNTIFS('Graduate Preferences'!B36:ZZ36,C35),\"\")","v":""},{"$f":"IF(A35<=NGrad,IF(D35=0,0,MATCH(C35,'Graduate Preferences'!B36:ZZ36,0)),\"\")","v":""},"","","","SBTD",2,null,""]
[33,{"$f":"IF(A36<=NGrad,'Graduate Preferences'!A37,\"\")","v":""},{"$f":"IF(A36<=NGrad,Process!A36,\"\")","v":""},{"$f":"IF(A36<=NGrad,COUNTIFS('Graduate Preferences'!B37:ZZ37,C36),\"\")","v":""},{"$f":"IF(A36<=NGrad,IF(D36=0,0,MATCH(C36,'Graduate Preferences'!B37:ZZ37,0)),\"\")","v":""},"","","","BPD",1,null,""]
[34,{"$f":"IF(A37<=NGrad,'Graduate Preferences'!A38,\"\")","v":""},{"$f":"IF(A37<=NGrad,Process!A37,\"\")","v":""},{"$f":"IF(A37<=NGrad,COUNTIFS('Graduate Preferences'!B38:ZZ38,C37),\"\")","v":""},{"$f":"IF(A37<=NGrad,IF(D37=0,0,MATCH(C37,'Graduate Preferences'!B38:ZZ38,0)),\"\")","v":""},"","","","FSSN",12,null,""]
[35,{"$f":"IF(A38<=NGrad,'Graduate Preferences'!A39,\"\")","v":""},{"$f":"IF(A38<=NGrad,Process!A38,\"\")","v":""},{"$f":"IF(A38<=NGrad,COUNTIFS('Graduate Preferences'!B39:ZZ39,C38),\"\")","v":""},{"$f":"IF(A38<=NGrad,IF(D38=0,0,MATCH(C38,'Graduate Preferences'!B39:ZZ39,0)),\"\")","v":""},"","","","IMTD",2,null,""]
[36,{"$f":"IF(A39<=NGrad,'Graduate Preferences'!A40,\"\")","v":""},{"$f":"IF(A39<=NGrad,Process!A39,\"\")","v":""},{"$f":"IF(A39<=NGrad,COUNTIFS('Graduate Preferences'!B40:ZZ40,C39),\"\")","v":""},{"$f":"IF(A39<=NGrad,IF(D39=0,0,MATCH(C39,'Graduate Preferences'!B40:ZZ40,0)),\"\")","v":""},"","","","IIED",16,null,""]
[37,{"$f":"IF(A40<=NGrad,'Graduate Preferences'!A41,\"\")","v":""},{"$f":"IF(A40<=NGrad,Process!A40,\"\")","v":""},{"$f":"IF(A40<=NGrad,COUNTIFS('Graduate Preferences'!B41:ZZ41,C40),\"\")","v":""},{"$f":"IF(A40<=NGrad,IF(D40=0,0,MATCH(C40,'Graduate Preferences'!B41:ZZ41,0)),\"\")","v":""},"","","",null,null,null,""]
[38,{"$f":"IF(A41<=NGrad,'Graduate Preferences'!A42,\"\")","v":""},{"$f":"IF(A41<=NGrad,Process!A41,\"\")","v":""},{"$f":"IF(A41<=NGrad,COUNTIFS('Graduate Preferences'!B42:ZZ42,C41),\"\")","v":""},{"$f":"IF(A41<=NGrad,IF(D41=0,0,MATCH(C41,'Graduate Preferences'!B42:ZZ42,0)),\"\")","v":""},"","","",null,null,null,""]
[39,{"$f":"IF(A42<=NGrad,'Graduate Preferences'!A43,\"\")","v":""},{"$f":"IF(A42<=NGrad,Process!A42,\"\")","v":""},{"$f":"IF(A42<=NGrad,COUNTIFS('Graduate Preferences'!B43:ZZ43,C42),\"\")","v":""},{"$f":"IF(A42<=NGrad,IF(D42=0,0,MATCH(C42,'Graduate Preferences'!B43:ZZ43,0)),\"\")","v":""},"","","",null,null,null,""]
[40,{"$f":"IF(A43<=NGrad,'Graduate Preferences'!A44,\"\")","v":""},{"$f":"IF(A43<=NGrad,Process!A43,\"\")","v":""},{"$f":"IF(A43<=NGrad,COUNTIFS('Graduate Preferences'!B44:ZZ44,C43),\"\")","v":""},{"$f":"IF(A43<=NGrad,IF(D43=0,0,MATCH(C43,'Graduate Preferences'!B44:ZZ44,0)),\"\")","v":""},"","","",null,null,null,""]
[41,{"$f":"IF(A44<=NGrad,'Graduate Preferences'!A45,\"\")","v":""},{"$f":"IF(A44<=NGrad,Process!A44,\"\")","v":""},{"$f":"IF(A44<=NGrad,COUNTIFS('Graduate Preferences'!B45:ZZ45,C44),\"\")","v":""},{"$f":"IF(A44<=NGrad,IF(D44=0,0,MATCH(C44,'Graduate Preferences'!B45:ZZ45,0)),\"\")","v":""},"","","",null,null,null,""]
[42,{"$f":"IF(A45<=NGrad,'Graduate Preferences'!A46,\"\")","v":""},{"$f":"IF(A45<=NGrad,Process!A45,\"\")","v":""},{"$f":"IF(A45<=NGrad,COUNTIFS('Graduate Preferences'!B46:ZZ46,C45),\"\")","v":""},{"$f":"IF(A45<=NGrad,IF(D45=0,0,MATCH(C45,'Graduate Preferences'!B46:ZZ46,0)),\"\")","v":""},"","","",null,null,null,""]
[43,{"$f":"IF(A46<=NGrad,'Graduate Preferences'!A47,\"\")","v":""},{"$f":"IF(A46<=NGrad,Process!A46,\"\")","v":""},{"$f":"IF(A46<=NGrad,COUNTIFS('Graduate Preferences'!B47:ZZ47,C46),\"\")","v":""},{"$f":"IF(A46<=NGrad,IF(D46=0,0,MATCH(C46,'Graduate Preferences'!B47:ZZ47,0)),\"\")","v":""},"","","",null,null,null,""]
[44,{"$f":"IF(A47<=NGrad,'Graduate Preferences'!A48,\"\")","v":""},{"$f":"IF(A47<=NGrad,Process!A47,\"\")","v":""},{"$f":"IF(A47<=NGrad,COUNTIFS('Graduate Preferences'!B48:ZZ48,C47),\"\")","v":""},{"$f":"IF(A47<=NGrad,IF(D47=0,0,MATCH(C47,'Graduate Preferences'!B48:ZZ48,0)),\"\")","v":""},"","","",null,null,null,""]
[45,{"$f":"IF(A48<=NGrad,'Graduate Preferences'!A49,\"\")","v":""},{"$f":"IF(A48<=NGrad,Process!A48,\"\")","v":""},{"$f":"IF(A48<=NGrad,COUNTIFS('Graduate Preferences'!B49:ZZ49,C48),\"\")","v":""},{"$f":"IF(A48<=NGrad,IF(D48=0,0,MATCH(C48,'Graduate Preferences'!B49:ZZ49,0)),\"\")","v":""},"","","",null,null,null,""]
[46,{"$f":"IF(A49<=NGrad,'Graduate Preferences'!A50,\"\")","v":""},{"$f":"IF(A49<=NGrad,Process!A49,\"\")","v":""},{"$f":"IF(A49<=NGrad,COUNTIFS('Graduate Preferences'!B50:ZZ50,C49),\"\")","v":""},{"$f":"IF(A49<=NGrad,IF(D49=0,0,MATCH(C49,'Graduate Preferences'!B50:ZZ50,0)),\"\")","v":""},"","","",null,null,null,""]
[47,{"$f":"IF(A50<=NGrad,'Graduate Preferences'!A51,\"\")","v":""},{"$f":"IF(A50<=NGrad,Process!A50,\"\")","v":""},{"$f":"IF(A50<=NGrad,COUNTIFS('Graduate Preferences'!B51:ZZ51,C50),\"\")","v":""},{"$f":"IF(A50<=NGrad,IF(D50=0,0,MATCH(C50,'Graduate Preferences'!B51:ZZ51,0)),\"\")","v":""},"","","",null,null,null,""]
[48,{"$f":"IF(A51<=NGrad,'Graduate Preferences'!A52,\"\")","v":""},{"$f":"IF(A51<=NGrad,Process!A51,\"\")","v":""},{"$f":"IF(A51<=NGrad,COUNTIFS('Graduate Preferences'!B52:ZZ52,C51),\"\")","v":""},{"$f":"IF(A51<=NGrad,IF(D51=0,0,MATCH(C51,'Graduate Preferences'!B52:ZZ52,0)),\"\")","v":""},"","","",null,null,null,""]
[49,{"$f":"IF(A52<=NGrad,'Graduate Preferences'!A53,\"\")","v":""},{"$f":"IF(A52<=NGrad,Process!A52,\"\")","v":""},{"$f":"IF(A52<=NGrad,COUNTIFS('Graduate Preferences'!B53:ZZ53,C52),\"\")","v":""},{"$f":"IF(A52<=NGrad,IF(D52=0,0,MATCH(C52,'Graduate Preferences'!B53:ZZ53,0)),\"\")","v":""},"","","",null,null,null,""]
[50,{"$f":"IF(A53<=NGrad,'Graduate Preferences'!A54,\"\")","v":""},{"$f":"IF(A53<=NGrad,Process!A53,\"\")","v":""},{"$f":"IF(A53<=NGrad,COUNTIFS('Graduate Preferences'!B54:ZZ54,C53),\"\")","v":""},{"$f":"IF(A53<=NGrad,IF(D53=0,0,MATCH(C53,'Graduate Preferences'!B54:ZZ54,0)),\"\")","v":""},"","","",null,null,null,""]
[51,{"$f":"IF(A54<=NGrad,'Graduate Preferences'!A55,\"\")","v":""},{"$f":"IF(A54<=NGrad,Process!A54,\"\")","v":""},{"$f":"IF(A54<=NGrad,COUNTIFS('Graduate Preferences'!B55:ZZ55,C54),\"\")","v":""},{"$f":"IF(A54<=NGrad,IF(D54=0,0,MATCH(C54,'Graduate Preferences'!B55:ZZ55,0)),\"\")","v":""},"","","",null,null,null,""]
[52,{"$f":"IF(A55<=NGrad,'Graduate Preferences'!A56,\"\")","v":""},{"$f":"IF(A55<=NGrad,Process!A55,\"\")","v":""},{"$f":"IF(A55<=NGrad,COUNTIFS('Graduate Preferences'!B56:ZZ56,C55),\"\")","v":""},{"$f":"IF(A55<=NGrad,IF(D55=0,0,MATCH(C55,'Graduate Preferences'!B56:ZZ56,0)),\"\")","v":""},"","","",null,null,null,""]
[53,{"$f":"IF(A56<=NGrad,'Graduate Preferences'!A57,\"\")","v":""},{"$f":"IF(A56<=NGrad,Process!A56,\"\")","v":""},{"$f":"IF(A56<=NGrad,COUNTIFS('Graduate Preferences'!B57:ZZ57,C56),\"\")","v":""},{"$f":"IF(A56<=NGrad,IF(D56=0,0,MATCH(C56,'Graduate Preferences'!B57:ZZ57,0)),\"\")","v":""},"","","",null,null,null,""]
[54,{"$f":"IF(A57<=NGrad,'Graduate Preferences'!A58,\"\")","v":""},{"$f":"IF(A57<=NGrad,Process!A57,\"\")","v":""},{"$f":"IF(A57<=NGrad,COUNTIFS('Graduate Preferences'!B58:ZZ58,C57),\"\")","v":""},{"$f":"IF(A57<=NGrad,IF(D57=0,0,MATCH(C57,'Graduate Preferences'!B58:ZZ58,0)),\"\")","v":""},"","","",null,null,null,""]
[55,{"$f":"IF(A58<=NGrad,'Graduate Preferences'!A59,\"\")","v":""},{"$f":"IF(A58<=NGrad,Process!A58,\"\")","v":""},{"$f":"IF(A58<=NGrad,COUNTIFS('Graduate Preferences'!B59:ZZ59,C58),\"\")","v":""},{"$f":"IF(A58<=NGrad,IF(D58=0,0,MATCH(C58,'Graduate Preferences'!B59:ZZ59,0)),\"\")","v":""},"","","",null,null,null,""]
[56,{"$f":"IF(A59<=NGrad,'Graduate Preferences'!A60,\"\")","v":""},{"$f":"IF(A59<=NGrad,Process!A59,\"\")","v":""},{"$f":"IF(A59<=NGrad,COUNTIFS('Graduate Preferences'!B60:ZZ60,C59),\"\")","v":""},{"$f":"IF(A59<=NGrad,IF(D59=0,0,MATCH(C59,'Graduate Preferences'!B60:ZZ60,0)),\"\")","v":""},"","","",null,null,null,""]
[57,{"$f":"IF(A60<=NGrad,'Graduate Preferences'!A61,\"\")","v":""},{"$f":"IF(A60<=NGrad,Process!A60,\"\")","v":""},{"$f":"IF(A60<=NGrad,COUNTIFS('Graduate Preferences'!B61:ZZ61,C60),\"\")","v":""},{"$f":"IF(A60<=NGrad,IF(D60=0,0,MATCH(C60,'Graduate Preferences'!B61:ZZ61,0)),\"\")","v":""},"","","",null,null,null,""]
[58,{"$f":"IF(A61<=NGrad,'Graduate Preferences'!A62,\"\")","v":""},{"$f":"IF(A61<=NGrad,Process!A61,\"\")","v":""},{"$f":"IF(A61<=NGrad,COUNTIFS('Graduate Preferences'!B62:ZZ62,C61),\"\")","v":""},{"$f":"IF(A61<=NGrad,IF(D61=0,0,MATCH(C61,'Graduate Preferences'!B62:ZZ62,0)),\"\")","v":""},"","","",null,null,null,""]
[59,{"$f":"IF(A62<=NGrad,'Graduate Preferences'!A63,\"\")","v":""},{"$f":"IF(A62<=NGrad,Process!A62,\"\")","v":""},{"$f":"IF(A62<=NGrad,COUNTIFS('Graduate Preferences'!B63:ZZ63,C62),\"\")","v":""},{"$f":"IF(A62<=NGrad,IF(D62=0,0,MATCH(C62,'Graduate Preferences'!B63:ZZ63,0)),\"\")","v":""},"","","",null,null,null,""]
[60,{"$f":"IF(A63<=NGrad,'Graduate Preferences'!A64,\"\")","v":""},{"$f":"IF(A63<=NGrad,Process!A63,\"\")","v":""},{"$f":"IF(A63<=NGrad,COUNTIFS('Graduate Preferences'!B64:ZZ64,C63),\"\")","v":""},{"$f":"IF(A63<=NGrad,IF(D63=0,0,MATCH(C63,'Graduate Preferences'!B64:ZZ64,0)),\"\")","v":""},"","","",null,null,null,""]
[61,{"$f":"IF(A64<=NGrad,'Graduate Preferences'!A65,\"\")","v":""},{"$f":"IF(A64<=NGrad,Process!A64,\"\")","v":""},{"$f":"IF(A64<=NGrad,COUNTIFS('Graduate Preferences'!B65:ZZ65,C64),\"\")","v":""},{"$f":"IF(A64<=NGrad,IF(D64=0,0,MATCH(C64,'Graduate Preferences'!B65:ZZ65,0)),\"\")","v":""},"","","",null,null,null,""]
[62,{"$f":"IF(A65<=NGrad,'Graduate Preferences'!A66,\"\")","v":""},{"$f":"IF(A65<=NGrad,Process!A65,\"\")","v":""},{"$f":"IF(A65<=NGrad,COUNTIFS('Graduate Preferences'!B66:ZZ66,C65),\"\")","v":""},{"$f":"IF(A65<=NGrad,IF(D65=0,0,MATCH(C65,'Graduate Preferences'!B66:ZZ66,0)),\"\")","v":""},"","","",null,null,null,""]
[63,{"$f":"IF(A66<=NGrad,'Graduate Preferences'!A67,\"\")","v":""},{"$f":"IF(A66<=NGrad,Process!A66,\"\")","v":""},{"$f":"IF(A66<=NGrad,COUNTIFS('Graduate Preferences'!B67:ZZ67,C66),\"\")","v":""},{"$f":"IF(A66<=NGrad,IF(D66=0,0,MATCH(C66,'Graduate Preferences'!B67:ZZ67,0)),\"\")","v":""},"","","",null,null,null,""]
[64,{"$f":"IF(A67<=NGrad,'Graduate Preferences'!A68,\"\")","v":""},{"$f":"IF(A67<=NGrad,Process!A67,\"\")","v":""},{"$f":"IF(A67<=NGrad,COUNTIFS('Graduate Preferences'!B68:ZZ68,C67),\"\")","v":""},{"$f":"IF(A67<=NGrad,IF(D67=0,0,MATCH(C67,'Graduate Preferences'!B68:ZZ68,0)),\"\")","v":""},"","","",null,null,null,""]
[65,{"$f":"IF(A68<=NGrad,'Graduate Preferences'!A69,\"\")","v":""},{"$f":"IF(A68<=NGrad,Process!A68,\"\")","v":""},{"$f":"IF(A68<=NGrad,COUNTIFS('Graduate Preferences'!B69:ZZ69,C68),\"\")","v":""},{"$f":"IF(A68<=NGrad,IF(D68=0,0,MATCH(C68,'Graduate Preferences'!B69:ZZ69,0)),\"\")","v":""},"","","",null,null,null,""]
[66,{"$f":"IF(A69<=NGrad,'Graduate Preferences'!A70,\"\")","v":""},{"$f":"IF(A69<=NGrad,Process!A69,\"\")","v":""},{"$f":"IF(A69<=NGrad,COUNTIFS('Graduate Preferences'!B70:ZZ70,C69),\"\")","v":""},{"$f":"IF(A69<=NGrad,IF(D69=0,0,MATCH(C69,'Graduate Preferences'!B70:ZZ70,0)),\"\")","v":""},"",{"$f":"IF(F69=\"\",\"\",RANK(F69,F$4:F$1000))","v":""},"",null,null,null,{"$f":"IF(MAX(H$4:H$1000)>=A69,MATCH(A69,H$4:H$1000,0),\"\")","v":""}]
[67,{"$f":"IF(A70<=NGrad,'Graduate Preferences'!A71,\"\")","v":""},{"$f":"IF(A70<=NGrad,Process!A70,\"\")","v":""},{"$f":"IF(A70<=NGrad,COUNTIFS('Graduate Preferences'!B71:ZZ71,C70),\"\")","v":""},{"$f":"IF(A70<=NGrad,IF(D70=0,0,MATCH(C70,'Graduate Preferences'!B71:ZZ71,0)),\"\")","v":""},{"$f":"IF(AND(J70<>\"-\",J70>0,I70=F$2),J70,\"\")","v":""},"",{"$f":"IF(F70=\"\",\"\",MAX(G$4:G$1000)-G70+1)","v":""},null,null,null,""]
[68,{"$f":"IF(A71<=NGrad,'Graduate Preferences'!A72,\"\")","v":""},{"$f":"IF(A71<=NGrad,Process!A71,\"\")","v":""},{"$f":"IF(A71<=NGrad,COUNTIFS('Graduate Preferences'!B72:ZZ72,C71),\"\")","v":""},{"$f":"IF(A71<=NGrad,IF(D71=0,0,MATCH(C71,'Graduate Preferences'!B72:ZZ72,0)),\"\")","v":""},"","","",null,null,null,""]
[69,{"$f":"IF(A72<=NGrad,'Graduate Preferences'!A73,\"\")","v":""},{"$f":"IF(A72<=NGrad,Process!A72,\"\")","v":""},{"$f":"IF(A72<=NGrad,COUNTIFS('Graduate Preferences'!B73:ZZ73,C72),\"\")","v":""},{"$f":"IF(A72<=NGrad,IF(D72=0,0,MATCH(C72,'Graduate Preferences'!B73:ZZ73,0)),\"\")","v":""},"","","",null,null,null,""]
[70,{"$f":"IF(A73<=NGrad,'Graduate Preferences'!A74,\"\")","v":""},{"$f":"IF(A73<=NGrad,Process!A73,\"\")","v":""},{"$f":"IF(A73<=NGrad,COUNTIFS('Graduate Preferences'!B74:ZZ74,C73),\"\")","v":""},{"$f":"IF(A73<=NGrad,IF(D73=0,0,MATCH(C73,'Graduate Preferences'!B74:ZZ74,0)),\"\")","v":""},"","","",null,null,null,""]
[71,{"$f":"IF(A74<=NGrad,'Graduate Preferences'!A75,\"\")","v":""},{"$f":"IF(A74<=NGrad,Process!A74,\"\")","v":""},{"$f":"IF(A74<=NGrad,COUNTIFS('Graduate Preferences'!B75:ZZ75,C74),\"\")","v":""},{"$f":"IF(A74<=NGrad,IF(D74=0,0,MATCH(C74,'Graduate Preferences'!B75:ZZ75,0)),\"\")","v":""},"","","",null,null,null,""]
[72,{"$f":"IF(A75<=NGrad,'Graduate Preferences'!A76,\"\")","v":""},{"$f":"IF(A75<=NGrad,Process!A75,\"\")","v":""},{"$f":"IF(A75<=NGrad,COUNTIFS('Graduate Preferences'!B76:ZZ76,C75),\"\")","v":""},{"$f":"IF(A75<=NGrad,IF(D75=0,0,MATCH(C75,'Graduate Preferences'!B76:ZZ76,0)),\"\")","v":""},"","","",null,null,null,""]
[73,{"$f":"IF(A76<=NGrad,'Graduate Preferences'!A77,\"\")","v":""},{"$f":"IF(A76<=NGrad,Process!A76,\"\")","v":""},{"$f":"IF(A76<=NGrad,COUNTIFS('Graduate Preferences'!B77:ZZ77,C76),\"\")","v":""},{"$f":"IF(A76<=NGrad,IF(D76=0,0,MATCH(C76,'Graduate Preferences'!B77:ZZ77,0)),\"\")","v":""},"","","",null,null,null,""]
[74,{"$f":"IF(A77<=NGrad,'Graduate Preferences'!A78,\"\")","v":""},{"$f":"IF(A77<=NGrad,Process!A77,\"\")","v":""},{"$f":"IF(A77<=NGrad,COUNTIFS('Graduate Preferences'!B78:ZZ78,C77),\"\")","v":""},{"$f":"IF(A77<=NGrad,IF(D77=0,0,MATCH(C77,'Graduate Preferences'!B78:ZZ78,0)),\"\")","v":""},"","","",null,null,null,""]
[75,{"$f":"IF(A78<=NGrad,'Graduate Preferences'!A79,\"\")","v":""},{"$f":"IF(A78<=NGrad,Process!A78,\"\")","v":""},{"$f":"IF(A78<=NGrad,COUNTIFS('Graduate Preferences'!B79:ZZ79,C78),\"\")","v":""},{"$f":"IF(A78<=NGrad,IF(D78=0,0,MATCH(C78,'Graduate Preferences'!B79:ZZ79,0)),\"\")","v":""},"","","",null,null,null,""]
[76,{"$f":"IF(A79<=NGrad,'Graduate Preferences'!A80,\"\")","v":""},{"$f":"IF(A79<=NGrad,Process!A79,\"\")","v":""},{"$f":"IF(A79<=NGrad,COUNTIFS('Graduate Preferences'!B80:ZZ80,C79),\"\")","v":""},{"$f":"IF(A79<=NGrad,IF(D79=0,0,MATCH(C79,'Graduate Preferences'!B80:ZZ80,0)),\"\")","v":""},"","","",null,null,null,""]
[77,{"$f":"IF(A80<=NGrad,'Graduate Preferences'!A81,\"\")","v":""},{"$f":"IF(A80<=NGrad,Process!A80,\"\")","v":""},{"$f":"IF(A80<=NGrad,COUNTIFS('Graduate Preferences'!B81:ZZ81,C80),\"\")","v":""},{"$f":"IF(A80<=NGrad,IF(D80=0,0,MATCH(C80,'Graduate Preferences'!B81:ZZ81,0)),\"\")","v":""},"","","",null,null,null,""]
[78,{"$f":"IF(A81<=NGrad,'Graduate Preferences'!A82,\"\")","v":""},{"$f":"IF(A81<=NGrad,Process!A81,\"\")","v":""},{"$f":"IF(A81<=NGrad,COUNTIFS('Graduate Preferences'!B82:ZZ82,C81),\"\")","v":""},{"$f":"IF(A81<=NGrad,IF(D81=0,0,MATCH(C81,'Graduate Preferences'!B82:ZZ82,0)),\"\")","v":""},"","","",null,null,null,""]
[79,{"$f":"IF(A82<=NGrad,'Graduate Preferences'!A83,\"\")","v":""},{"$f":"IF(A82<=NGrad,Process!A82,\"\")","v":""},{"$f":"IF(A82<=NGrad,COUNTIFS('Graduate Preferences'!B83:ZZ83,C82),\"\")","v":""},{"$f":"IF(A82<=NGrad,IF(D82=0,0,MATCH(C82,'Graduate Preferences'!B83:ZZ83,0)),\"\")","v":""},"","","",null,null,null,""]
[80,{"$f":"IF(A83<=NGrad,'Graduate Preferences'!A84,\"\")","v":""},{"$f":"IF(A83<=NGrad,Process!A83,\"\")","v":""},{"$f":"IF(A83<=NGrad,COUNTIFS('Graduate Preferences'!B84:ZZ84,C83),\"\")","v":""},{"$f":"IF(A83<=NGrad,IF(D83=0,0,MATCH(C83,'Graduate Preferences'!B84:ZZ84,0)),\"\")","v":""},"","","",null,null,null,""]
[81,{"$f":"IF(A84<=NGrad,'Graduate Preferences'!A85,\"\")","v":""},{"$f":"IF(A84<=NGrad,Process!A84,\"\")","v":""},{"$f":"IF(A84<=NGrad,COUNTIFS('Graduate Preferences'!B85:ZZ85,C84),\"\")","v":""},{"$f":"IF(A84<=NGrad,IF(D84=0,0,MATCH(C84,'Graduate Preferences'!B85:ZZ85,0)),\"\")","v":""},"","","",null,null,null,""]
[82,{"$f":"IF(A85<=NGrad,'Graduate Preferences'!A86,\"\")","v":""},{"$f":"IF(A85<=NGrad,Process!A85,\"\")","v":""},{"$f":"IF(A85<=NGrad,COUNTIFS('Graduate Preferences'!B86:ZZ86,C85),\"\")","v":""},{"$f":"IF(A85<=NGrad,IF(D85=0,0,MATCH(C85,'Graduate Preferences'!B86:ZZ86,0)),\"\")","v":""},"","","",null,null,null,""]
[83,{"$f":"IF(A86<=NGrad,'Graduate Preferences'!A87,\"\")","v":""},{"$f":"IF(A86<=NGrad,Process!A86,\"\")","v":""},{"$f":"IF(A86<=NGrad,COUNTIFS('Graduate Preferences'!B87:ZZ87,C86),\"\")","v":""},{"$f":"IF(A86<=NGrad,IF(D86=0,0,MATCH(C86,'Graduate Preferences'!B87:ZZ87,0)),\"\")","v":""},"","","",null,null,null,""]
[84,{"$f":"IF(A87<=NGrad,'Graduate Preferences'!A88,\"\")","v":""},{"$f":"IF(A87<=NGrad,Process!A87,\"\")","v":""},{"$f":"IF(A87<=NGrad,COUNTIFS('Graduate Preferences'!B88:ZZ88,C87),\"\")","v":""},{"$f":"IF(A87<=NGrad,IF(D87=0,0,MATCH(C87,'Graduate Preferences'!B88:ZZ88,0)),\"\")","v":""},"","","",null,null,null,""]
[85,{"$f":"IF(A88<=NGrad,'Graduate Preferences'!A89,\"\")","v":""},{"$f":"IF(A88<=NGrad,Process!A88,\"\")","v":""},{"$f":"IF(A88<=NGrad,COUNTIFS('Graduate Preferences'!B89:ZZ89,C88),\"\")","v":""},{"$f":"IF(A88<=NGrad,IF(D88=0,0,MATCH(C88,'Graduate Preferences'!B89:ZZ89,0)),\"\")","v":""},"","","",null,null,null,""]
[86,{"$f":"IF(A89<=NGrad,'Graduate Preferences'!A90,\"\")","v":""},{"$f":"IF(A89<=NGrad,Process!A89,\"\")","v":""},{"$f":"IF(A89<=NGrad,COUNTIFS('Graduate Preferences'!B90:ZZ90,C89),\"\")","v":""},{"$f":"IF(A89<=NGrad,IF(D89=0,0,MATCH(C89,'Graduate Preferences'!B90:ZZ90,0)),\"\")","v":""},"","","",null,null,null,""]
[87,{"$f":"IF(A90<=NGrad,'Graduate Preferences'!A91,\"\")","v":""},{"$f":"IF(A90<=NGrad,Process!A90,\"\")","v":""},{"$f":"IF(A90<=NGrad,COUNTIFS('Graduate Preferences'!B91:ZZ91,C90),\"\")","v":""},{"$f":"IF(A90<=NGrad,IF(D90=0,0,MATCH(C90,'Graduate Preferences'!B91:ZZ91,0)),\"\")","v":""},"","","",null,null,null,""]
[88,{"$f":"IF(A91<=NGrad,'Graduate Preferences'!A92,\"\")","v":""},{"$f":"IF(A91<=NGrad,Process!A91,\"\")","v":""},{"$f":"IF(A91<=NGrad,COUNTIFS('Graduate Preferences'!B92:ZZ92,C91),\"\")","v":""},{"$f":"IF(A91<=NGrad,IF(D91=0,0,MATCH(C91,'Graduate Preferences'!B92:ZZ92,0)),\"\")","v":""},"","","",null,null,null,""]
[89,{"$f":"IF(A92<=NGrad,'Graduate Preferences'!A93,\"\")","v":""},{"$f":"IF(A92<=NGrad,Process!A92,\"\")","v":""},{"$f":"IF(A92<=NGrad,COUNTIFS('Graduate Preferences'!B93:ZZ93,C92),\"\")","v":""},{"$f":"IF(A92<=NGrad,IF(D92=0,0,MATCH(C92,'Graduate Preferences'!B93:ZZ93,0)),\"\")","v":""},"","","",null,null,null,""]
[90,{"$f":"IF(A93<=NGrad,'Graduate Preferences'!A94,\"\")","v":""},{"$f":"IF(A93<=NGrad,Process!A93,\"\")","v":""},{"$f":"IF(A93<=NGrad,COUNTIFS('Graduate Preferences'!B94:ZZ94,C93),\"\")","v":""},{"$f":"IF(A93<=NGrad,IF(D93=0,0,MATCH(C93,'Graduate Preferences'!B94:ZZ94,0)),\"\")","v":""},"","","",null,null,null,""]
[91,{"$f":"IF(A94<=NGrad,'Graduate Preferences'!A95,\"\")","v":""},{"$f":"IF(A94<=NGrad,Process!A94,\"\")","v":""},{"$f":"IF(A94<=NGrad,COUNTIFS('Graduate Preferences'!B95:ZZ95,C94),\"\")","v":""},{"$f":"IF(A94<=NGrad,IF(D94=0,0,MATCH(C94,'Graduate Preferences'!B95:ZZ95,0)),\"\")","v":""},"","","",null,null,null,""]
[92,{"$f":"IF(A95<=NGrad,'Graduate Preferences'!A96,\"\")","v":""},{"$f":"IF(A95<=NGrad,Process!A95,\"\")","v":""},{"$f":"IF(A95<=NGrad,COUNTIFS('Graduate Preferences'!B96:ZZ96,C95),\"\")","v":""},{"$f":"IF(A95<=NGrad,IF(D95=0,0,MATCH(C95,'Graduate Preferences'!B96:ZZ96,0)),\"\")","v":""},"","","",null,null,null,""]
[93,{"$f":"IF(A96<=NGrad,'Graduate Preferences'!A97,\"\")","v":""},{"$f":"IF(A96<=NGrad,Process!A96,\"\")","v":""},{"$f":"IF(A96<=NGrad,COUNTIFS('Graduate Preferences'!B97:ZZ97,C96),\"\")","v":""},{"$f":"IF(A96<=NGrad,IF(D96=0,0,MATCH(C96,'Graduate Preferences'!B97:ZZ97,0)),\"\")","v":""},"","","",null,null,null,""]
[94,{"$f":"IF(A97<=NGrad,'Graduate Preferences'!A98,\"\")","v":""},{"$f":"IF(A97<=NGrad,Process!A97,\"\")","v":""},{"$f":"IF(A97<=NGrad,COUNTIFS('Graduate Preferences'!B98:ZZ98,C97),\"\")","v":""},{"$f":"IF(A97<=NGrad,IF(D97=0,0,MATCH(C97,'Graduate Preferences'!B98:ZZ98,0)),\"\")","v":""},"","","",null,null,null,""]
[95,{"$f":"IF(A98<=NGrad,'Graduate Preferences'!A99,\"\")","v":""},{"$f":"IF(A98<=NGrad,Process!A98,\"\")","v":""},{"$f":"IF(A98<=NGrad,COUNTIFS('Graduate Preferences'!B99:ZZ99,C98),\"\")","v":""},{"$f":"IF(A98<=NGrad,IF(D98=0,0,MATCH(C98,'Graduate Preferences'!B99:ZZ99,0)),\"\")","v":""},"","","",null,null,null,""]
[96,{"$f":"IF(A99<=NGrad,'Graduate Preferences'!A100,\"\")","v":""},{"$f":"IF(A99<=NGrad,Process!A99,\"\")","v":""},{"$f":"IF(A99<=NGrad,COUNTIFS('Graduate Preferences'!B100:ZZ100,C99),\"\")","v":""},{"$f":"IF(A99<=NGrad,IF(D99=0,0,MATCH(C99,'Graduate Preferences'!B100:ZZ100,0)),\"\")","v":""},"","","",null,null,null,""]
[97,{"$f":"IF(A100<=NGrad,'Graduate Preferences'!A101,\"\")","v":""},{"$f":"IF(A100<=NGrad,Process!A100,\"\")","v":""},{"$f":"IF(A100<=NGrad,COUNTIFS('Graduate Preferences'!B101:ZZ101,C100),\"\")","v":""},{"$f":"IF(A100<=NGrad,IF(D100=0,0,MATCH(C100,'Graduate Preferences'!B101:ZZ101,0)),\"\")","v":""},"","","",null,null,null,""]
[98,{"$f":"IF(A101<=NGrad,'Graduate Preferences'!A102,\"\")","v":""},{"$f":"IF(A101<=NGrad,Process!A101,\"\")","v":""},{"$f":"IF(A101<=NGrad,COUNTIFS('Graduate Preferences'!B102:ZZ102,C101),\"\")","v":""},{"$f":"IF(A101<=NGrad,IF(D101=0,0,MATCH(C101,'Graduate Preferences'!B102:ZZ102,0)),\"\")","v":""},"","","",null,null,null,""]
[99,{"$f":"IF(A102<=NGrad,'Graduate Preferences'!A103,\"\")","v":""},{"$f":"IF(A102<=NGrad,Process!A102,\"\")","v":""},{"$f":"IF(A102<=NGrad,COUNTIFS('Graduate Preferences'!B103:ZZ103,C102),\"\")","v":""},{"$f":"IF(A102<=NGrad,IF(D102=0,0,MATCH(C102,'Graduate Preferences'!B103:ZZ103,0)),\"\")","v":""},"","","",null,null,null,""]
[100,{"$f":"IF(A103<=NGrad,'Graduate Preferences'!A104,\"\")","v":""},{"$f":"IF(A103<=NGrad,Process!A103,\"\")","v":""},{"$f":"IF(A103<=NGrad,COUNTIFS('Graduate Preferences'!B104:ZZ104,C103),\"\")","v":""},{"$f":"IF(A103<=NGrad,IF(D103=0,0,MATCH(C103,'Graduate Preferences'!B104:ZZ104,0)),\"\")","v":""},"","","",null,null,null,""]
[101,{"$f":"IF(A104<=NGrad,'Graduate Preferences'!A105,\"\")","v":""},{"$f":"IF(A104<=NGrad,Process!A104,\"\")","v":""},{"$f":"IF(A104<=NGrad,COUNTIFS('Graduate Preferences'!B105:ZZ105,C104),\"\")","v":""},{"$f":"IF(A104<=NGrad,IF(D104=0,0,MATCH(C104,'Graduate Preferences'!B105:ZZ105,0)),\"\")","v":""},"","","",null,null,null,""]
[102,{"$f":"IF(A105<=NGrad,'Graduate Preferences'!A106,\"\")","v":""},{"$f":"IF(A105<=NGrad,Process!A105,\"\")","v":""},{"$f":"IF(A105<=NGrad,COUNTIFS('Graduate Preferences'!B106:ZZ106,C105),\"\")","v":""},{"$f":"IF(A105<=NGrad,IF(D105=0,0,MATCH(C105,'Graduate Preferences'!B106:ZZ106,0)),\"\")","v":""},"","","",null,null,null,""]
[103,{"$f":"IF(A106<=NGrad,'Graduate Preferences'!A107,\"\")","v":""},{"$f":"IF(A106<=NGrad,Process!A106,\"\")","v":""},{"$f":"IF(A106<=NGrad,COUNTIFS('Graduate Preferences'!B107:ZZ107,C106),\"\")","v":""},{"$f":"IF(A106<=NGrad,IF(D106=0,0,MATCH(C106,'Graduate Preferences'!B107:ZZ107,0)),\"\")","v":""},"","","",null,null,null,""]
[104,{"$f":"IF(A107<=NGrad,'Graduate Preferences'!A108,\"\")","v":""},{"$f":"IF(A107<=NGrad,Process!A107,\"\")","v":""},{"$f":"IF(A107<=NGrad,COUNTIFS('Graduate Preferences'!B108:ZZ108,C107),\"\")","v":""},{"$f":"IF(A107<=NGrad,IF(D107=0,0,MATCH(C107,'Graduate Preferences'!B108:ZZ108,0)),\"\")","v":""},"","","",null,null,null,""]
[105,{"$f":"IF(A108<=NGrad,'Graduate Preferences'!A109,\"\")","v":""},{"$f":"IF(A108<=NGrad,Process!A108,\"\")","v":""},{"$f":"IF(A108<=NGrad,COUNTIFS('Graduate Preferences'!B109:ZZ109,C108),\"\")","v":""},{"$f":"IF(A108<=NGrad,IF(D108=0,0,MATCH(C108,'Graduate Preferences'!B109:ZZ109,0)),\"\")","v":""},"","","",null,null,null,""]
[106,{"$f":"IF(A109<=NGrad,'Graduate Preferences'!A110,\"\")","v":""},{"$f":"IF(A109<=NGrad,Process!A109,\"\")","v":""},{"$f":"IF(A109<=NGrad,COUNTIFS('Graduate Preferences'!B110:ZZ110,C109),\"\")","v":""},{"$f":"IF(A109<=NGrad,IF(D109=0,0,MATCH(C109,'Graduate Preferences'!B110:ZZ110,0)),\"\")","v":""},"","","",null,null,null,""]
[107,{"$f":"IF(A110<=NGrad,'Graduate Preferences'!A111,\"\")","v":""},{"$f":"IF(A110<=NGrad,Process!A110,\"\")","v":""},{"$f":"IF(A110<=NGrad,COUNTIFS('Graduate Preferences'!B111:ZZ111,C110),\"\")","v":""},{"$f":"IF(A110<=NGrad,IF(D110=0,0,MATCH(C110,'Graduate Preferences'!B111:ZZ111,0)),\"\")","v":""},"","","",null,null,null,""]
[108,{"$f":"IF(A111<=NGrad,'Graduate Preferences'!A112,\"\")","v":""},{"$f":"IF(A111<=NGrad,Process!A111,\"\")","v":""},{"$f":"IF(A111<=NGrad,COUNTIFS('Graduate Preferences'!B112:ZZ112,C111),\"\")","v":""},{"$f":"IF(A111<=NGrad,IF(D111=0,0,MATCH(C111,'Graduate Preferences'!B112:ZZ112,0)),\"\")","v":""},"","","",null,null,null,""]
[109,{"$f":"IF(A112<=NGrad,'Graduate Preferences'!A113,\"\")","v":""},{"$f":"IF(A112<=NGrad,Process!A112,\"\")","v":""},{"$f":"IF(A112<=NGrad,COUNTIFS('Graduate Preferences'!B113:ZZ113,C112),\"\")","v":""},{"$f":"IF(A112<=NGrad,IF(D112=0,0,MATCH(C112,'Graduate Preferences'!B113:ZZ113,0)),\"\")","v":""},"","","",null,null,null,""]
[110,{"$f":"IF(A113<=NGrad,'Graduate Preferences'!A114,\"\")","v":""},{"$f":"IF(A113<=NGrad,Process!A113,\"\")","v":""},{"$f":"IF(A113<=NGrad,COUNTIFS('Graduate Preferences'!B114:ZZ114,C113),\"\")","v":""},{"$f":"IF(A113<=NGrad,IF(D113=0,0,MATCH(C113,'Graduate Preferences'!B114:ZZ114,0)),\"\")","v":""},"","","",null,null,null,""]
[111,{"$f":"IF(A114<=NGrad,'Graduate Preferences'!A115,\"\")","v":""},{"$f":"IF(A114<=NGrad,Process!A114,\"\")","v":""},{"$f":"IF(A114<=NGrad,COUNTIFS('Graduate Preferences'!B115:ZZ115,C114),\"\")","v":""},{"$f":"IF(A114<=NGrad,IF(D114=0,0,MATCH(C114,'Graduate Preferences'!B115:ZZ115,0)),\"\")","v":""},"","","",null,null,null,""]
[112,{"$f":"IF(A115<=NGrad,'Graduate Preferences'!A116,\"\")","v":""},{"$f":"IF(A115<=NGrad,Process!A115,\"\")","v":""},{"$f":"IF(A115<=NGrad,COUNTIFS('Graduate Preferences'!B116:ZZ116,C115),\"\")","v":""},{"$f":"IF(A115<=NGrad,IF(D115=0,0,MATCH(C115,'Graduate Preferences'!B116:ZZ116,0)),\"\")","v":""},"","","",null,null,null,""]
[113,{"$f":"IF(A116<=NGrad,'Graduate Preferences'!A117,\"\")","v":""},{"$f":"IF(A116<=NGrad,Process!A116,\"\")","v":""},{"$f":"IF(A116<=NGrad,COUNTIFS('Graduate Preferences'!B117:ZZ117,C116),\"\")","v":""},{"$f":"IF(A116<=NGrad,IF(D116=0,0,MATCH(C116,'Graduate Preferences'!B117:ZZ117,0)),\"\")","v":""},"","","",null,null,null,""]
[114,{"$f":"IF(A117<=NGrad,'Graduate Preferences'!A118,\"\")","v":""},{"$f":"IF(A117<=NGrad,Process!A117,\"\")","v":""},{"$f":"IF(A117<=NGrad,COUNTIFS('Graduate Preferences'!B118:ZZ118,C117),\"\")","v":""},{"$f":"IF(A117<=NGrad,IF(D117=0,0,MATCH(C117,'Graduate Preferences'!B118:ZZ118,0)),\"\")","v":""},"","","",null,null,null,""]
[115,{"$f":"IF(A118<=NGrad,'Graduate Preferences'!A119,\"\")","v":""},{"$f":"IF(A118<=NGrad,Process!A118,\"\")","v":""},{"$f":"IF(A118<=NGrad,COUNTIFS('Graduate Preferences'!B119:ZZ119,C118),\"\")","v":""},{"$f":"IF(A118<=NGrad,IF(D118=0,0,MATCH(C118,'Graduate Preferences'!B119:ZZ119,0)),\"\")","v":""},"","","",null,null,null,""]
[116,{"$f":"IF(A119<=NGrad,'Graduate Preferences'!A120,\"\")","v":""},{"$f":"IF(A119<=NGrad,Process!A119,\"\")","v":""},{"$f":"IF(A119<=NGrad,COUNTIFS('Graduate Preferences'!B120:ZZ120,C119),\"\")","v":""},{"$f":"IF(A119<=NGrad,IF(D119=0,0,MATCH(C119,'Graduate Preferences'!B120:ZZ120,0)),\"\")","v":""},"","","",null,null,null,""]
[117,{"$f":"IF(A120<=NGrad,'Graduate Preferences'!A121,\"\")","v":""},{"$f":"IF(A120<=NGrad,Process!A120,\"\")","v":""},{"$f":"IF(A120<=NGrad,COUNTIFS('Graduate Preferences'!B121:ZZ121,C120),\"\")","v":""},{"$f":"IF(A120<=NGrad,IF(D120=0,0,MATCH(C120,'Graduate Preferences'!B121:ZZ121,0)),\"\")","v":""},"","","",null,null,null,""]
[118,{"$f":"IF(A121<=NGrad,'Graduate Preferences'!A122,\"\")","v":""},{"$f":"IF(A121<=NGrad,Process!A121,\"\")","v":""},{"$f":"IF(A121<=NGrad,COUNTIFS('Graduate Preferences'!B122:ZZ122,C121),\"\")","v":""},{"$f":"IF(A121<=NGrad,IF(D121=0,0,MATCH(C121,'Graduate Preferences'!B122:ZZ122,0)),\"\")","v":""},"","","",null,null,null,""]
[119,{"$f":"IF(A122<=NGrad,'Graduate Preferences'!A123,\"\")","v":""},{"$f":"IF(A122<=NGrad,Process!A122,\"\")","v":""},{"$f":"IF(A122<=NGrad,COUNTIFS('Graduate Preferences'!B123:ZZ123,C122),\"\")","v":""},{"$f":"IF(A122<=NGrad,IF(D122=0,0,MATCH(C122,'Graduate Preferences'!B123:ZZ123,0)),\"\")","v":""},"","","",null,null,null,""]
[120,{"$f":"IF(A123<=NGrad,'Graduate Preferences'!A124,\"\")","v":""},{"$f":"IF(A123<=NGrad,Process!A123,\"\")","v":""},{"$f":"IF(A123<=NGrad,COUNTIFS('Graduate Preferences'!B124:ZZ124,C123),\"\")","v":""},{"$f":"IF(A123<=NGrad,IF(D123=0,0,MATCH(C123,'Graduate Preferences'!B124:ZZ124,0)),\"\")","v":""},"","","",null,null,null,""]
[121,{"$f":"IF(A124<=NGrad,'Graduate Preferences'!A125,\"\")","v":""},{"$f":"IF(A124<=NGrad,Process!A124,\"\")","v":""},{"$f":"IF(A124<=NGrad,COUNTIFS('Graduate Preferences'!B125:ZZ125,C124),\"\")","v":""},{"$f":"IF(A124<=NGrad,IF(D124=0,0,MATCH(C124,'Graduate Preferences'!B125:ZZ125,0)),\"\")","v":""},"","","",null,null,null,""]
[122,{"$f":"IF(A125<=NGrad,'Graduate Preferences'!A126,\"\")","v":""},{"$f":"IF(A125<=NGrad,Process!A125,\"\")","v":""},{"$f":"IF(A125<=NGrad,COUNTIFS('Graduate Preferences'!B126:ZZ126,C125),\"\")","v":""},{"$f":"IF(A125<=NGrad,IF(D125=0,0,MATCH(C125,'Graduate Preferences'!B126:ZZ126,0)),\"\")","v":""},"","","",null,null,null,""]
[123,{"$f":"IF(A126<=NGrad,'Graduate Preferences'!A127,\"\")","v":""},{"$f":"IF(A126<=NGrad,Process!A126,\"\")","v":""},{"$f":"IF(A126<=NGrad,COUNTIFS('Graduate Preferences'!B127:ZZ127,C126),\"\")","v":""},{"$f":"IF(A126<=NGrad,IF(D126=0,0,MATCH(C126,'Graduate Preferences'!B127:ZZ127,0)),\"\")","v":""},"","","",null,null,null,""]
[124,{"$f":"IF(A127<=NGrad,'Graduate Preferences'!A128,\"\")","v":""},{"$f":"IF(A127<=NGrad,Process!A127,\"\")","v":""},{"$f":"IF(A127<=NGrad,COUNTIFS('Graduate Preferences'!B128:ZZ128,C127),\"\")","v":""},{"$f":"IF(A127<=NGrad,IF(D127=0,0,MATCH(C127,'Graduate Preferences'!B128:ZZ128,0)),\"\")","v":""},"","","",null,null,null,""]
[125,{"$f":"IF(A128<=NGrad,'Graduate Preferences'!A129,\"\")","v":""},{"$f":"IF(A128<=NGrad,Process!A128,\"\")","v":""},{"$f":"IF(A128<=NGrad,COUNTIFS('Graduate Preferences'!B129:ZZ129,C128),\"\")","v":""},{"$f":"IF(A128<=NGrad,IF(D128=0,0,MATCH(C128,'Graduate Preferences'!B129:ZZ129,0)),\"\")","v":""},"","","",null,null,null,""]
[126,{"$f":"IF(A129<=NGrad,'Graduate Preferences'!A130,\"\")","v":""},{"$f":"IF(A129<=NGrad,Process!A129,\"\")","v":""},{"$f":"IF(A129<=NGrad,COUNTIFS('Graduate Preferences'!B130:ZZ130,C129),\"\")","v":""},{"$f":"IF(A129<=NGrad,IF(D129=0,0,MATCH(C129,'Graduate Preferences'!B130:ZZ130,0)),\"\")","v":""},"","","",null,null,null,""]
[127,{"$f":"IF(A130<=NGrad,'Graduate Preferences'!A131,\"\")","v":""},{"$f":"IF(A130<=NGrad,Process!A130,\"\")","v":""},{"$f":"IF(A130<=NGrad,COUNTIFS('Graduate Preferences'!B131:ZZ131,C130),\"\")","v":""},{"$f":"IF(A130<=NGrad,IF(D130=0,0,MATCH(C130,'Graduate Preferences'!B131:ZZ131,0)),\"\")","v":""},"","","",null,null,null,""]
[128,{"$f":"IF(A131<=NGrad,'Graduate Preferences'!A132,\"\")","v":""},{"$f":"IF(A131<=NGrad,Process!A131,\"\")","v":""},{"$f":"IF(A131<=NGrad,COUNTIFS('Graduate Preferences'!B132:ZZ132,C131),\"\")","v":""},{"$f":"IF(A131<=NGrad,IF(D131=0,0,MATCH(C131,'Graduate Preferences'!B132:ZZ132,0)),\"\")","v":""},"","","",null,null,null,""]
[129,{"$f":"IF(A132<=NGrad,'Graduate Preferences'!A133,\"\")","v":""},{"$f":"IF(A132<=NGrad,Process!A132,\"\")","v":""},{"$f":"IF(A132<=NGrad,COUNTIFS('Graduate Preferences'!B133:ZZ133,C132),\"\")","v":""},{"$f":"IF(A132<=NGrad,IF(D132=0,0,MATCH(C132,'Graduate Preferences'!B133:ZZ133,0)),\"\")","v":""},"","","",null,null,null,""]
[130,{"$f":"IF(A133<=NGrad,'Graduate Preferences'!A134,\"\")","v":""},{"$f":"IF(A133<=NGrad,Process!A133,\"\")","v":""},{"$f":"IF(A133<=NGrad,COUNTIFS('Graduate Preferences'!B134:ZZ134,C133),\"\")","v":""},{"$f":"IF(A133<=NGrad,IF(D133=0,0,MATCH(C133,'Graduate Preferences'!B134:ZZ134,0)),\"\")","v":""},"",{"$f":"IF(F133=\"\",\"\",RANK(F133,F$4:F$1000))","v":""},"",null,null,null,{"$f":"IF(MAX(H$4:H$1000)>=A133,MATCH(A133,H$4:H$1000,0),\"\")","v":""}]
[131,{"$f":"IF(A134<=NGrad,'Graduate Preferences'!A135,\"\")","v":""},{"$f":"IF(A134<=NGrad,Process!A134,\"\")","v":""},{"$f":"IF(A134<=NGrad,COUNTIFS('Graduate Preferences'!B135:ZZ135,C134),\"\")","v":""},{"$f":"IF(A134<=NGrad,IF(D134=0,0,MATCH(C134,'Graduate Preferences'!B135:ZZ135,0)),\"\")","v":""},{"$f":"IF(AND(J134<>\"-\",J134>0,I134=F$2),J134,\"\")","v":""},"",{"$f":"IF(F134=\"\",\"\",MAX(G$4:G$1000)-G134+1)","v":""},null,null,null,""]
[132,{"$f":"IF(A135<=NGrad,'Graduate Preferences'!A136,\"\")","v":""},{"$f":"IF(A135<=NGrad,Process!A135,\"\")","v":""},{"$f":"IF(A135<=NGrad,COUNTIFS('Graduate Preferences'!B136:ZZ136,C135),\"\")","v":""},{"$f":"IF(A135<=NGrad,IF(D135=0,0,MATCH(C135,'Graduate Preferences'!B136:ZZ136,0)),\"\")","v":""},"","","",null,null,null,""]
[133,{"$f":"IF(A136<=NGrad,'Graduate Preferences'!A137,\"\")","v":""},{"$f":"IF(A136<=NGrad,Process!A136,\"\")","v":""},{"$f":"IF(A136<=NGrad,COUNTIFS('Graduate Preferences'!B137:ZZ137,C136),\"\")","v":""},{"$f":"IF(A136<=NGrad,IF(D136=0,0,MATCH(C136,'Graduate Preferences'!B137:ZZ137,0)),\"\")","v":""},"","","",null,null,null,""]
[134,{"$f":"IF(A137<=NGrad,'Graduate Preferences'!A138,\"\")","v":""},{"$f":"IF(A137<=NGrad,Process!A137,\"\")","v":""},{"$f":"IF(A137<=NGrad,COUNTIFS('Graduate Preferences'!B138:ZZ138,C137),\"\")","v":""},{"$f":"IF(A137<=NGrad,IF(D137=0,0,MATCH(C137,'Graduate Preferences'!B138:ZZ138,0)),\"\")","v":""},"","","",null,null,null,""]
[135,{"$f":"IF(A138<=NGrad,'Graduate Preferences'!A139,\"\")","v":""},{"$f":"IF(A138<=NGrad,Process!A138,\"\")","v":""},{"$f":"IF(A138<=NGrad,COUNTIFS('Graduate Preferences'!B139:ZZ139,C138),\"\")","v":""},{"$f":"IF(A138<=NGrad,IF(D138=0,0,MATCH(C138,'Graduate Preferences'!B139:ZZ139,0)),\"\")","v":""},"","","",null,null,null,""]
[136,{"$f":"IF(A139<=NGrad,'Graduate Preferences'!A140,\"\")","v":""},{"$f":"IF(A139<=NGrad,Process!A139,\"\")","v":""},{"$f":"IF(A139<=NGrad,COUNTIFS('Graduate Preferences'!B140:ZZ140,C139),\"\")","v":""},{"$f":"IF(A139<=NGrad,IF(D139=0,0,MATCH(C139,'Graduate Preferences'!B140:ZZ140,0)),\"\")","v":""},"","","",null,null,null,""]
[137,{"$f":"IF(A140<=NGrad,'Graduate Preferences'!A141,\"\")","v":""},{"$f":"IF(A140<=NGrad,Process!A140,\"\")","v":""},{"$f":"IF(A140<=NGrad,COUNTIFS('Graduate Preferences'!B141:ZZ141,C140),\"\")","v":""},{"$f":"IF(A140<=NGrad,IF(D140=0,0,MATCH(C140,'Graduate Preferences'!B141:ZZ141,0)),\"\")","v":""},"","","",null,null,null,""]
[138,{"$f":"IF(A141<=NGrad,'Graduate Preferences'!A142,\"\")","v":""},{"$f":"IF(A141<=NGrad,Process!A141,\"\")","v":""},{"$f":"IF(A141<=NGrad,COUNTIFS('Graduate Preferences'!B142:ZZ142,C141),\"\")","v":""},{"$f":"IF(A141<=NGrad,IF(D141=0,0,MATCH(C141,'Graduate Preferences'!B142:ZZ142,0)),\"\")","v":""},"","","",null,null,null,""]
[139,{"$f":"IF(A142<=NGrad,'Graduate Preferences'!A143,\"\")","v":""},{"$f":"IF(A142<=NGrad,Process!A142,\"\")","v":""},{"$f":"IF(A142<=NGrad,COUNTIFS('Graduate Preferences'!B143:ZZ143,C142),\"\")","v":""},{"$f":"IF(A142<=NGrad,IF(D142=0,0,MATCH(C142,'Graduate Preferences'!B143:ZZ143,0)),\"\")","v":""},"","","",null,null,null,""]
[140,{"$f":"IF(A143<=NGrad,'Graduate Preferences'!A144,\"\")","v":""},{"$f":"IF(A143<=NGrad,Process!A143,\"\")","v":""},{"$f":"IF(A143<=NGrad,COUNTIFS('Graduate Preferences'!B144:ZZ144,C143),\"\")","v":""},{"$f":"IF(A143<=NGrad,IF(D143=0,0,MATCH(C143,'Graduate Preferences'!B144:ZZ144,0)),\"\")","v":""},"","","",null,null,null,""]
[141,{"$f":"IF(A144<=NGrad,'Graduate Preferences'!A145,\"\")","v":""},{"$f":"IF(A144<=NGrad,Process!A144,\"\")","v":""},{"$f":"IF(A144<=NGrad,COUNTIFS('Graduate Preferences'!B145:ZZ145,C144),\"\")","v":""},{"$f":"IF(A144<=NGrad,IF(D144=0,0,MATCH(C144,'Graduate Preferences'!B145:ZZ145,0)),\"\")","v":""},"","","",null,null,null,""]
[142,{"$f":"IF(A145<=NGrad,'Graduate Preferences'!A146,\"\")","v":""},{"$f":"IF(A145<=NGrad,Process!A145,\"\")","v":""},{"$f":"IF(A145<=NGrad,COUNTIFS('Graduate Preferences'!B146:ZZ146,C145),\"\")","v":""},{"$f":"IF(A145<=NGrad,IF(D145=0,0,MATCH(C145,'Graduate Preferences'!B146:ZZ146,0)),\"\")","v":""},"","","",null,null,null,""]
[143,{"$f":"IF(A146<=NGrad,'Graduate Preferences'!A147,\"\")","v":""},{"$f":"IF(A146<=NGrad,Process!A146,\"\")","v":""},{"$f":"IF(A146<=NGrad,COUNTIFS('Graduate Preferences'!B147:ZZ147,C146),\"\")","v":""},{"$f":"IF(A146<=NGrad,IF(D146=0,0,MATCH(C146,'Graduate Preferences'!B147:ZZ147,0)),\"\")","v":""},"","","",null,null,null,""]
[144,{"$f":"IF(A147<=NGrad,'Graduate Preferences'!A148,\"\")","v":""},{"$f":"IF(A147<=NGrad,Process!A147,\"\")","v":""},{"$f":"IF(A147<=NGrad,COUNTIFS('Graduate Preferences'!B148:ZZ148,C147),\"\")","v":""},{"$f":"IF(A147<=NGrad,IF(D147=0,0,MATCH(C147,'Graduate Preferences'!B148:ZZ148,0)),\"\")","v":""},"","","",null,null,null,""]
[145,{"$f":"IF(A148<=NGrad,'Graduate Preferences'!A149,\"\")","v":""},{"$f":"IF(A148<=NGrad,Process!A148,\"\")","v":""},{"$f":"IF(A148<=NGrad,COUNTIFS('Graduate Preferences'!B149:ZZ149,C148),\"\")","v":""},{"$f":"IF(A148<=NGrad,IF(D148=0,0,MATCH(C148,'Graduate Preferences'!B149:ZZ149,0)),\"\")","v":""},"","","",null,null,null,""]
[146,{"$f":"IF(A149<=NGrad,'Graduate Preferences'!A150,\"\")","v":""},{"$f":"IF(A149<=NGrad,Process!A149,\"\")","v":""},{"$f":"IF(A149<=NGrad,COUNTIFS('Graduate Preferences'!B150:ZZ150,C149),\"\")","v":""},{"$f":"IF(A149<=NGrad,IF(D149=0,0,MATCH(C149,'Graduate Preferences'!B150:ZZ150,0)),\"\")","v":""},"","","",null,null,null,""]
[147,{"$f":"IF(A150<=NGrad,'Graduate Preferences'!A151,\"\")","v":""},{"$f":"IF(A150<=NGrad,Process!A150,\"\")","v":""},{"$f":"IF(A150<=NGrad,COUNTIFS('Graduate Preferences'!B151:ZZ151,C150),\"\")","v":""},{"$f":"IF(A150<=NGrad,IF(D150=0,0,MATCH(C150,'Graduate Preferences'!B151:ZZ151,0)),\"\")","v":""},"","","",null,null,null,""]
[148,{"$f":"IF(A151<=NGrad,'Graduate Preferences'!A152,\"\")","v":""},{"$f":"IF(A151<=NGrad,Process!A151,\"\")","v":""},{"$f":"IF(A151<=NGrad,COUNTIFS('Graduate Preferences'!B152:ZZ152,C151),\"\")","v":""},{"$f":"IF(A151<=NGrad,IF(D151=0,0,MATCH(C151,'Graduate Preferences'!B152:ZZ152,0)),\"\")","v":""},"","","",null,null,null,""]
[149,{"$f":"IF(A152<=NGrad,'Graduate Preferences'!A153,\"\")","v":""},{"$f":"IF(A152<=NGrad,Process!A152,\"\")","v":""},{"$f":"IF(A152<=NGrad,COUNTIFS('Graduate Preferences'!B153:ZZ153,C152),\"\")","v":""},{"$f":"IF(A152<=NGrad,IF(D152=0,0,MATCH(C152,'Graduate Preferences'!B153:ZZ153,0)),\"\")","v":""},"","","",null,null,null,""]
[150,{"$f":"IF(A153<=NGrad,'Graduate Preferences'!A154,\"\")","v":""},{"$f":"IF(A153<=NGrad,Process!A153,\"\")","v":""},{"$f":"IF(A153<=NGrad,COUNTIFS('Graduate Preferences'!B154:ZZ154,C153),\"\")","v":""},{"$f":"IF(A153<=NGrad,IF(D153=0,0,MATCH(C153,'Graduate Preferences'!B154:ZZ154,0)),\"\")","v":""},"","","",null,null,null,""]
[151,{"$f":"IF(A154<=NGrad,'Graduate Preferences'!A155,\"\")","v":""},{"$f":"IF(A154<=NGrad,Process!A154,\"\")","v":""},{"$f":"IF(A154<=NGrad,COUNTIFS('Graduate Preferences'!B155:ZZ155,C154),\"\")","v":""},{"$f":"IF(A154<=NGrad,IF(D154=0,0,MATCH(C154,'Graduate Preferences'!B155:ZZ155,0)),\"\")","v":""},"","","",null,null,null,""]
[152,{"$f":"IF(A155<=NGrad,'Graduate Preferences'!A156,\"\")","v":""},{"$f":"IF(A155<=NGrad,Process!A155,\"\")","v":""},{"$f":"IF(A155<=NGrad,COUNTIFS('Graduate Preferences'!B156:ZZ156,C155),\"\")","v":""},{"$f":"IF(A155<=NGrad,IF(D155=0,0,MATCH(C155,'Graduate Preferences'!B156:ZZ156,0)),\"\")","v":""},"","","",null,null,null,""]
[153,{"$f":"IF(A156<=NGrad,'Graduate Preferences'!A157,\"\")","v":""},{"$f":"IF(A156<=NGrad,Process!A156,\"\")","v":""},{"$f":"IF(A156<=NGrad,COUNTIFS('Graduate Preferences'!B157:ZZ157,C156),\"\")","v":""},{"$f":"IF(A156<=NGrad,IF(D156=0,0,MATCH(C156,'Graduate Preferences'!B157:ZZ157,0)),\"\")","v":""},"","","",null,null,null,""]
[154,{"$f":"IF(A157<=NGrad,'Graduate Preferences'!A158,\"\")","v":""},{"$f":"IF(A157<=NGrad,Process!A157,\"\")","v":""},{"$f":"IF(A157<=NGrad,COUNTIFS('Graduate Preferences'!B158:ZZ158,C157),\"\")","v":""},{"$f":"IF(A157<=NGrad,IF(D157=0,0,MATCH(C157,'Graduate Preferences'!B158:ZZ158,0)),\"\")","v":""},"","","",null,null,null,""]
[155,{"$f":"IF(A158<=NGrad,'Graduate Preferences'!A159,\"\")","v":""},{"$f":"IF(A158<=NGrad,Process!A158,\"\")","v":""},{"$f":"IF(A158<=NGrad,COUNTIFS('Graduate Preferences'!B159:ZZ159,C158),\"\")","v":""},{"$f":"IF(A158<=NGrad,IF(D158=0,0,MATCH(C158,'Graduate Preferences'!B159:ZZ159,0)),\"\")","v":""},"","","",null,null,null,""]
[156,{"$f":"IF(A159<=NGrad,'Graduate Preferences'!A160,\"\")","v":""},{"$f":"IF(A159<=NGrad,Process!A159,\"\")","v":""},{"$f":"IF(A159<=NGrad,COUNTIFS('Graduate Preferences'!B160:ZZ160,C159),\"\")","v":""},{"$f":"IF(A159<=NGrad,IF(D159=0,0,MATCH(C159,'Graduate Preferences'!B160:ZZ160,0)),\"\")","v":""},"","","",null,null,null,""]
[157,{"$f":"IF(A160<=NGrad,'Graduate Preferences'!A161,\"\")","v":""},{"$f":"IF(A160<=NGrad,Process!A160,\"\")","v":""},{"$f":"IF(A160<=NGrad,COUNTIFS('Graduate Preferences'!B161:ZZ161,C160),\"\")","v":""},{"$f":"IF(A160<=NGrad,IF(D160=0,0,MATCH(C160,'Graduate Preferences'!B161:ZZ161,0)),\"\")","v":""},"","","",null,null,null,""]
[158,{"$f":"IF(A161<=NGrad,'Graduate Preferences'!A162,\"\")","v":""},{"$f":"IF(A161<=NGrad,Process!A161,\"\")","v":""},{"$f":"IF(A161<=NGrad,COUNTIFS('Graduate Preferences'!B162:ZZ162,C161),\"\")","v":""},{"$f":"IF(A161<=NGrad,IF(D161=0,0,MATCH(C161,'Graduate Preferences'!B162:ZZ162,0)),\"\")","v":""},"","","",null,null,null,""]
[159,{"$f":"IF(A162<=NGrad,'Graduate Preferences'!A163,\"\")","v":""},{"$f":"IF(A162<=NGrad,Process!A162,\"\")","v":""},{"$f":"IF(A162<=NGrad,COUNTIFS('Graduate Preferences'!B163:ZZ163,C162),\"\")","v":""},{"$f":"IF(A162<=NGrad,IF(D162=0,0,MATCH(C162,'Graduate Preferences'!B163:ZZ163,0)),\"\")","v":""},"","","",null,null,null,""]
[160,{"$f":"IF(A163<=NGrad,'Graduate Preferences'!A164,\"\")","v":""},{"$f":"IF(A163<=NGrad,Process!A163,\"\")","v":""},{"$f":"IF(A163<=NGrad,COUNTIFS('Graduate Preferences'!B164:ZZ164,C163),\"\")","v":""},{"$f":"IF(A163<=NGrad,IF(D163=0,0,MATCH(C163,'Graduate Preferences'!B164:ZZ164,0)),\"\")","v":""},"","","",null,null,null,""]
[161,{"$f":"IF(A164<=NGrad,'Graduate Preferences'!A165,\"\")","v":""},{"$f":"IF(A164<=NGrad,Process!A164,\"\")","v":""},{"$f":"IF(A164<=NGrad,COUNTIFS('Graduate Preferences'!B165:ZZ165,C164),\"\")","v":""},{"$f":"IF(A164<=NGrad,IF(D164=0,0,MATCH(C164,'Graduate Preferences'!B165:ZZ165,0)),\"\")","v":""},"","","",null,null,null,""]
[162,{"$f":"IF(A165<=NGrad,'Graduate Preferences'!A166,\"\")","v":""},{"$f":"IF(A165<=NGrad,Process!A165,\"\")","v":""},{"$f":"IF(A165<=NGrad,COUNTIFS('Graduate Preferences'!B166:ZZ166,C165),\"\")","v":""},{"$f":"IF(A165<=NGrad,IF(D165=0,0,MATCH(C165,'Graduate Preferences'!B166:ZZ166,0)),\"\")","v":""},"","","",null,null,null,""]
[163,{"$f":"IF(A166<=NGrad,'Graduate Preferences'!A167,\"\")","v":""},{"$f":"IF(A166<=NGrad,Process!A166,\"\")","v":""},{"$f":"IF(A166<=NGrad,COUNTIFS('Graduate Preferences'!B167:ZZ167,C166),\"\")","v":""},{"$f":"IF(A166<=NGrad,IF(D166=0,0,MATCH(C166,'Graduate Preferences'!B167:ZZ167,0)),\"\")","v":""},"","","",null,null,null,""]
[164,{"$f":"IF(A167<=NGrad,'Graduate Preferences'!A168,\"\")","v":""},{"$f":"IF(A167<=NGrad,Process!A167,\"\")","v":""},{"$f":"IF(A167<=NGrad,COUNTIFS('Graduate Preferences'!B168:ZZ168,C167),\"\")","v":""},{"$f":"IF(A167<=NGrad,IF(D167=0,0,MATCH(C167,'Graduate Preferences'!B168:ZZ168,0)),\"\")","v":""},"","","",null,null,null,""]
[165,{"$f":"IF(A168<=NGrad,'Graduate Preferences'!A169,\"\")","v":""},{"$f":"IF(A168<=NGrad,Process!A168,\"\")","v":""},{"$f":"IF(A168<=NGrad,COUNTIFS('Graduate Preferences'!B169:ZZ169,C168),\"\")","v":""},{"$f":"IF(A168<=NGrad,IF(D168=0,0,MATCH(C168,'Graduate Preferences'!B169:ZZ169,0)),\"\")","v":""},"","","",null,null,null,""]
[166,{"$f":"IF(A169<=NGrad,'Graduate Preferences'!A170,\"\")","v":""},{"$f":"IF(A169<=NGrad,Process!A169,\"\")","v":""},{"$f":"IF(A169<=NGrad,COUNTIFS('Graduate Preferences'!B170:ZZ170,C169),\"\")","v":""},{"$f":"IF(A169<=NGrad,IF(D169=0,0,MATCH(C169,'Graduate Preferences'!B170:ZZ170,0)),\"\")","v":""},"","","",null,null,null,""]
[167,{"$f":"IF(A170<=NGrad,'Graduate Preferences'!A171,\"\")","v":""},{"$f":"IF(A170<=NGrad,Process!A170,\"\")","v":""},{"$f":"IF(A170<=NGrad,COUNTIFS('Graduate Preferences'!B171:ZZ171,C170),\"\")","v":""},{"$f":"IF(A170<=NGrad,IF(D170=0,0,MATCH(C170,'Graduate Preferences'!B171:ZZ171,0)),\"\")","v":""},"","","",null,null,null,""]
[168,{"$f":"IF(A171<=NGrad,'Graduate Preferences'!A172,\"\")","v":""},{"$f":"IF(A171<=NGrad,Process!A171,\"\")","v":""},{"$f":"IF(A171<=NGrad,COUNTIFS('Graduate Preferences'!B172:ZZ172,C171),\"\")","v":""},{"$f":"IF(A171<=NGrad,IF(D171=0,0,MATCH(C171,'Graduate Preferences'!B172:ZZ172,0)),\"\")","v":""},"","","",null,null,null,""]
[169,{"$f":"IF(A172<=NGrad,'Graduate Preferences'!A173,\"\")","v":""},{"$f":"IF(A172<=NGrad,Process!A172,\"\")","v":""},{"$f":"IF(A172<=NGrad,COUNTIFS('Graduate Preferences'!B173:ZZ173,C172),\"\")","v":""},{"$f":"IF(A172<=NGrad,IF(D172=0,0,MATCH(C172,'Graduate Preferences'!B173:ZZ173,0)),\"\")","v":""},"","","",null,null,null,""]
[170,{"$f":"IF(A173<=NGrad,'Graduate Preferences'!A174,\"\")","v":""},{"$f":"IF(A173<=NGrad,Process!A173,\"\")","v":""},{"$f":"IF(A173<=NGrad,COUNTIFS('Graduate Preferences'!B174:ZZ174,C173),\"\")","v":""},{"$f":"IF(A173<=NGrad,IF(D173=0,0,MATCH(C173,'Graduate Preferences'!B174:ZZ174,0)),\"\")","v":""},"","","",null,null,null,""]
[171,{"$f":"IF(A174<=NGrad,'Graduate Preferences'!A175,\"\")","v":""},{"$f":"IF(A174<=NGrad,Process!A174,\"\")","v":""},{"$f":"IF(A174<=NGrad,COUNTIFS('Graduate Preferences'!B175:ZZ175,C174),\"\")","v":""},{"$f":"IF(A174<=NGrad,IF(D174=0,0,MATCH(C174,'Graduate Preferences'!B175:ZZ175,0)),\"\")","v":""},"","","",null,null,null,""]
[172,{"$f":"IF(A175<=NGrad,'Graduate Preferences'!A176,\"\")","v":""},{"$f":"IF(A175<=NGrad,Process!A175,\"\")","v":""},{"$f":"IF(A175<=NGrad,COUNTIFS('Graduate Preferences'!B176:ZZ176,C175),\"\")","v":""},{"$f":"IF(A175<=NGrad,IF(D175=0,0,MATCH(C175,'Graduate Preferences'!B176:ZZ176,0)),\"\")","v":""},"","","",null,null,null,""]
[173,{"$f":"IF(A176<=NGrad,'Graduate Preferences'!A177,\"\")","v":""},{"$f":"IF(A176<=NGrad,Process!A176,\"\")","v":""},{"$f":"IF(A176<=NGrad,COUNTIFS('Graduate Preferences'!B177:ZZ177,C176),\"\")","v":""},{"$f":"IF(A176<=NGrad,IF(D176=0,0,MATCH(C176,'Graduate Preferences'!B177:ZZ177,0)),\"\")","v":""},"","","",null,null,null,""]
[174,{"$f":"IF(A177<=NGrad,'Graduate Preferences'!A178,\"\")","v":""},{"$f":"IF(A177<=NGrad,Process!A177,\"\")","v":""},{"$f":"IF(A177<=NGrad,COUNTIFS('Graduate Preferences'!B178:ZZ178,C177),\"\")","v":""},{"$f":"IF(A177<=NGrad,IF(D177=0,0,MATCH(C177,'Graduate Preferences'!B178:ZZ178,0)),\"\")","v":""},"","","",null,null,null,""]
[175,{"$f":"IF(A178<=NGrad,'Graduate Preferences'!A179,\"\")","v":""},{"$f":"IF(A178<=NGrad,Process!A178,\"\")","v":""},{"$f":"IF(A178<=NGrad,COUNTIFS('Graduate Preferences'!B179:ZZ179,C178),\"\")","v":""},{"$f":"IF(A178<=NGrad,IF(D178=0,0,MATCH(C178,'Graduate Preferences'!B179:ZZ179,0)),\"\")","v":""},"","","",null,null,null,""]
[176,{"$f":"IF(A179<=NGrad,'Graduate Preferences'!A180,\"\")","v":""},{"$f":"IF(A179<=NGrad,Process!A179,\"\")","v":""},{"$f":"IF(A179<=NGrad,COUNTIFS('Graduate Preferences'!B180:ZZ180,C179),\"\")","v":""},{"$f":"IF(A179<=NGrad,IF(D179=0,0,MATCH(C179,'Graduate Preferences'!B180:ZZ180,0)),\"\")","v":""},"","","",null,null,null,""]
[177,{"$f":"IF(A180<=NGrad,'Graduate Preferences'!A181,\"\")","v":""},{"$f":"IF(A180<=NGrad,Process!A180,\"\")","v":""},{"$f":"IF(A180<=NGrad,COUNTIFS('Graduate Preferences'!B181:ZZ181,C180),\"\")","v":""},{"$f":"IF(A180<=NGrad,IF(D180=0,0,MATCH(C180,'Graduate Preferences'!B181:ZZ181,0)),\"\")","v":""},"","","",null,null,null,""]
[178,{"$f":"IF(A181<=NGrad,'Graduate Preferences'!A182,\"\")","v":""},{"$f":"IF(A181<=NGrad,Process!A181,\"\")","v":""},{"$f":"IF(A181<=NGrad,COUNTIFS('Graduate Preferences'!B182:ZZ182,C181),\"\")","v":""},{"$f":"IF(A181<=NGrad,IF(D181=0,0,MATCH(C181,'Graduate Preferences'!B182:ZZ182,0)),\"\")","v":""},"","","",null,null,null,""]
[179,{"$f":"IF(A182<=NGrad,'Graduate Preferences'!A183,\"\")","v":""},{"$f":"IF(A182<=NGrad,Process!A182,\"\")","v":""},{"$f":"IF(A182<=NGrad,COUNTIFS('Graduate Preferences'!B183:ZZ183,C182),\"\")","v":""},{"$f":"IF(A182<=NGrad,IF(D182=0,0,MATCH(C182,'Graduate Preferences'!B183:ZZ183,0)),\"\")","v":""},"","","",null,null,null,""]
[180,{"$f":"IF(A183<=NGrad,'Graduate Preferences'!A184,\"\")","v":""},{"$f":"IF(A183<=NGrad,Process!A183,\"\")","v":""},{"$f":"IF(A183<=NGrad,COUNTIFS('Graduate Preferences'!B184:ZZ184,C183),\"\")","v":""},{"$f":"IF(A183<=NGrad,IF(D183=0,0,MATCH(C183,'Graduate Preferences'!B184:ZZ184,0)),\"\")","v":""},"","","",null,null,null,""]
[181,{"$f":"IF(A184<=NGrad,'Graduate Preferences'!A185,\"\")","v":""},{"$f":"IF(A184<=NGrad,Process!A184,\"\")","v":""},{"$f":"IF(A184<=NGrad,COUNTIFS('Graduate Preferences'!B185:ZZ185,C184),\"\")","v":""},{"$f":"IF(A184<=NGrad,IF(D184=0,0,MATCH(C184,'Graduate Preferences'!B185:ZZ185,0)),\"\")","v":""},"","","",null,null,null,""]
[182,{"$f":"IF(A185<=NGrad,'Graduate Preferences'!A186,\"\")","v":""},{"$f":"IF(A185<=NGrad,Process!A185,\"\")","v":""},{"$f":"IF(A185<=NGrad,COUNTIFS('Graduate Preferences'!B186:ZZ186,C185),\"\")","v":""},{"$f":"IF(A185<=NGrad,IF(D185=0,0,MATCH(C185,'Graduate Preferences'!B186:ZZ186,0)),\"\")","v":""},"","","",null,null,null,""]
[183,{"$f":"IF(A186<=NGrad,'Graduate Preferences'!A187,\"\")","v":""},{"$f":"IF(A186<=NGrad,Process!A186,\"\")","v":""},{"$f":"IF(A186<=NGrad,COUNTIFS('Graduate Preferences'!B187:ZZ187,C186),\"\")","v":""},{"$f":"IF(A186<=NGrad,IF(D186=0,0,MATCH(C186,'Graduate Preferences'!B187:ZZ187,0)),\"\")","v":""},"","","",null,null,null,""]
[184,{"$f":"IF(A187<=NGrad,'Graduate Preferences'!A188,\"\")","v":""},{"$f":"IF(A187<=NGrad,Process!A187,\"\")","v":""},{"$f":"IF(A187<=NGrad,COUNTIFS('Graduate Preferences'!B188:ZZ188,C187),\"\")","v":""},{"$f":"IF(A187<=NGrad,IF(D187=0,0,MATCH(C187,'Graduate Preferences'!B188:ZZ188,0)),\"\")","v":""},"","","",null,null,null,""]
[185,{"$f":"IF(A188<=NGrad,'Graduate Preferences'!A189,\"\")","v":""},{"$f":"IF(A188<=NGrad,Process!A188,\"\")","v":""},{"$f":"IF(A188<=NGrad,COUNTIFS('Graduate Preferences'!B189:ZZ189,C188),\"\")","v":""},{"$f":"IF(A188<=NGrad,IF(D188=0,0,MATCH(C188,'Graduate Preferences'!B189:ZZ189,0)),\"\")","v":""},"","","",null,null,null,""]
[186,{"$f":"IF(A189<=NGrad,'Graduate Preferences'!A190,\"\")","v":""},{"$f":"IF(A189<=NGrad,Process!A189,\"\")","v":""},{"$f":"IF(A189<=NGrad,COUNTIFS('Graduate Preferences'!B190:ZZ190,C189),\"\")","v":""},{"$f":"IF(A189<=NGrad,IF(D189=0,0,MATCH(C189,'Graduate Preferences'!B190:ZZ190,0)),\"\")","v":""},"","","",null,null,null,""]
[187,{"$f":"IF(A190<=NGrad,'Graduate Preferences'!A191,\"\")","v":""},{"$f":"IF(A190<=NGrad,Process!A190,\"\")","v":""},{"$f":"IF(A190<=NGrad,COUNTIFS('Graduate Preferences'!B191:ZZ191,C190),\"\")","v":""},{"$f":"IF(A190<=NGrad,IF(D190=0,0,MATCH(C190,'Graduate Preferences'!B191:ZZ191,0)),\"\")","v":""},"","","",null,null,null,""]
[188,{"$f":"IF(A191<=NGrad,'Graduate Preferences'!A192,\"\")","v":""},{"$f":"IF(A191<=NGrad,Process!A191,\"\")","v":""},{"$f":"IF(A191<=NGrad,COUNTIFS('Graduate Preferences'!B192:ZZ192,C191),\"\")","v":""},{"$f":"IF(A191<=NGrad,IF(D191=0,0,MATCH(C191,'Graduate Preferences'!B192:ZZ192,0)),\"\")","v":""},"","","",null,null,null,""]
[189,{"$f":"IF(A192<=NGrad,'Graduate Preferences'!A193,\"\")","v":""},{"$f":"IF(A192<=NGrad,Process!A192,\"\")","v":""},{"$f":"IF(A192<=NGrad,COUNTIFS('Graduate Preferences'!B193:ZZ193,C192),\"\")","v":""},{"$f":"IF(A192<=NGrad,IF(D192=0,0,MATCH(C192,'Graduate Preferences'!B193:ZZ193,0)),\"\")","v":""},"","","",null,null,null,""]
[190,{"$f":"IF(A193<=NGrad,'Graduate Preferences'!A194,\"\")","v":""},{"$f":"IF(A193<=NGrad,Process!A193,\"\")","v":""},{"$f":"IF(A193<=NGrad,COUNTIFS('Graduate Preferences'!B194:ZZ194,C193),\"\")","v":""},{"$f":"IF(A193<=NGrad,IF(D193=0,0,MATCH(C193,'Graduate Preferences'!B194:ZZ194,0)),\"\")","v":""},"","","",null,null,null,""]
[191,{"$f":"IF(A194<=NGrad,'Graduate Preferences'!A195,\"\")","v":""},{"$f":"IF(A194<=NGrad,Process!A194,\"\")","v":""},{"$f":"IF(A194<=NGrad,COUNTIFS('Graduate Preferences'!B195:ZZ195,C194),\"\")","v":""},{"$f":"IF(A194<=NGrad,IF(D194=0,0,MATCH(C194,'Graduate Preferences'!B195:ZZ195,0)),\"\")","v":""},"","","",null,null,null,""]
[192,{"$f":"IF(A195<=NGrad,'Graduate Preferences'!A196,\"\")","v":""},{"$f":"IF(A195<=NGrad,Process!A195,\"\")","v":""},{"$f":"IF(A195<=NGrad,COUNTIFS('Graduate Preferences'!B196:ZZ196,C195),\"\")","v":""},{"$f":"IF(A195<=NGrad,IF(D195=0,0,MATCH(C195,'Graduate Preferences'!B196:ZZ196,0)),\"\")","v":""},"","","",null,null,null,""]
[193,{"$f":"IF(A196<=NGrad,'Graduate Preferences'!A197,\"\")","v":""},{"$f":"IF(A196<=NGrad,Process!A196,\"\")","v":""},{"$f":"IF(A196<=NGrad,COUNTIFS('Graduate Preferences'!B197:ZZ197,C196),\"\")","v":""},{"$f":"IF(A196<=NGrad,IF(D196=0,0,MATCH(C196,'Graduate Preferences'!B197:ZZ197,0)),\"\")","v":""},"","","",null,null,null,""]
[194,{"$f":"IF(A197<=NGrad,'Graduate Preferences'!A198,\"\")","v":""},{"$f":"IF(A197<=NGrad,Process!A197,\"\")","v":""},{"$f":"IF(A197<=NGrad,COUNTIFS('Graduate Preferences'!B198:ZZ198,C197),\"\")","v":""},{"$f":"IF(A197<=NGrad,IF(D197=0,0,MATCH(C197,'Graduate Preferences'!B198:ZZ198,0)),\"\")","v":""},"",{"$f":"IF(F197=\"\",\"\",RANK(F197,F$4:F$1000))","v":""},"",null,null,null,{"$f":"IF(MAX(H$4:H$1000)>=A197,MATCH(A197,H$4:H$1000,0),\"\")","v":""}]
[195,{"$f":"IF(A198<=NGrad,'Graduate Preferences'!A199,\"\")","v":""},{"$f":"IF(A198<=NGrad,Process!A198,\"\")","v":""},{"$f":"IF(A198<=NGrad,COUNTIFS('Graduate Preferences'!B199:ZZ199,C198),\"\")","v":""},{"$f":"IF(A198<=NGrad,IF(D198=0,0,MATCH(C198,'Graduate Preferences'!B199:ZZ199,0)),\"\")","v":""},{"$f":"IF(AND(J198<>\"-\",J198>0,I198=F$2),J198,\"\")","v":""},"",{"$f":"IF(F198=\"\",\"\",MAX(G$4:G$1000)-G198+1)","v":""},null,null,null,""]
[196,{"$f":"IF(A199<=NGrad,'Graduate Preferences'!A200,\"\")","v":""},{"$f":"IF(A199<=NGrad,Process!A199,\"\")","v":""},{"$f":"IF(A199<=NGrad,COUNTIFS('Graduate Preferences'!B200:ZZ200,C199),\"\")","v":""},{"$f":"IF(A199<=NGrad,IF(D199=0,0,MATCH(C199,'Graduate Preferences'!B200:ZZ200,0)),\"\")","v":""},"","","",null,null,null,""]
[197,{"$f":"IF(A200<=NGrad,'Graduate Preferences'!A201,\"\")","v":""},{"$f":"IF(A200<=NGrad,Process!A200,\"\")","v":""},{"$f":"IF(A200<=NGrad,COUNTIFS('Graduate Preferences'!B201:ZZ201,C200),\"\")","v":""},{"$f":"IF(A200<=NGrad,IF(D200=0,0,MATCH(C200,'Graduate Preferences'!B201:ZZ201,0)),\"\")","v":""},"","","",null,null,null,""]
[198,{"$f":"IF(A201<=NGrad,'Graduate Preferences'!A202,\"\")","v":""},{"$f":"IF(A201<=NGrad,Process!A201,\"\")","v":""},{"$f":"IF(A201<=NGrad,COUNTIFS('Graduate Preferences'!B202:ZZ202,C201),\"\")","v":""},{"$f":"IF(A201<=NGrad,IF(D201=0,0,MATCH(C201,'Graduate Preferences'!B202:ZZ202,0)),\"\")","v":""},"","","",null,null,null,""]
[199,{"$f":"IF(A202<=NGrad,'Graduate Preferences'!A203,\"\")","v":""},{"$f":"IF(A202<=NGrad,Process!A202,\"\")","v":""},{"$f":"IF(A202<=NGrad,COUNTIFS('Graduate Preferences'!B203:ZZ203,C202),\"\")","v":""},{"$f":"IF(A202<=NGrad,IF(D202=0,0,MATCH(C202,'Graduate Preferences'!B203:ZZ203,0)),\"\")","v":""},"","","",null,null,null,""]
[200,{"$f":"IF(A203<=NGrad,'Graduate Preferences'!A204,\"\")","v":""},{"$f":"IF(A203<=NGrad,Process!A203,\"\")","v":""},{"$f":"IF(A203<=NGrad,COUNTIFS('Graduate Preferences'!B204:ZZ204,C203),\"\")","v":""},{"$f":"IF(A203<=NGrad,IF(D203=0,0,MATCH(C203,'Graduate Preferences'!B204:ZZ204,0)),\"\")","v":""},"","","",null,null,null,""]
[201,{"$f":"IF(A204<=NGrad,'Graduate Preferences'!A205,\"\")","v":""},{"$f":"IF(A204<=NGrad,Process!A204,\"\")","v":""},{"$f":"IF(A204<=NGrad,COUNTIFS('Graduate Preferences'!B205:ZZ205,C204),\"\")","v":""},{"$f":"IF(A204<=NGrad,IF(D204=0,0,MATCH(C204,'Graduate Preferences'!B205:ZZ205,0)),\"\")","v":""},"","","",null,null,null,""]
[202,{"$f":"IF(A205<=NGrad,'Graduate Preferences'!A206,\"\")","v":""},{"$f":"IF(A205<=NGrad,Process!A205,\"\")","v":""},{"$f":"IF(A205<=NGrad,COUNTIFS('Graduate Preferences'!B206:ZZ206,C205),\"\")","v":""},{"$f":"IF(A205<=NGrad,IF(D205=0,0,MATCH(C205,'Graduate Preferences'!B206:ZZ206,0)),\"\")","v":""},"","","",null,null,null,""]
[203,{"$f":"IF(A206<=NGrad,'Graduate Preferences'!A207,\"\")","v":""},{"$f":"IF(A206<=NGrad,Process!A206,\"\")","v":""},{"$f":"IF(A206<=NGrad,COUNTIFS('Graduate Preferences'!B207:ZZ207,C206),\"\")","v":""},{"$f":"IF(A206<=NGrad,IF(D206=0,0,MATCH(C206,'Graduate Preferences'!B207:ZZ207,0)),\"\")","v":""},"","","",null,null,null,""]
[204,{"$f":"IF(A207<=NGrad,'Graduate Preferences'!A208,\"\")","v":""},{"$f":"IF(A207<=NGrad,Process!A207,\"\")","v":""},{"$f":"IF(A207<=NGrad,COUNTIFS('Graduate Preferences'!B208:ZZ208,C207),\"\")","v":""},{"$f":"IF(A207<=NGrad,IF(D207=0,0,MATCH(C207,'Graduate Preferences'!B208:ZZ208,0)),\"\")","v":""},"","","",null,null,null,""]
[205,{"$f":"IF(A208<=NGrad,'Graduate Preferences'!A209,\"\")","v":""},{"$f":"IF(A208<=NGrad,Process!A208,\"\")","v":""},{"$f":"IF(A208<=NGrad,COUNTIFS('Graduate Preferences'!B209:ZZ209,C208),\"\")","v":""},{"$f":"IF(A208<=NGrad,IF(D208=0,0,MATCH(C208,'Graduate Preferences'!B209:ZZ209,0)),\"\")","v":""},"","","",null,null,null,""]
[206,{"$f":"IF(A209<=NGrad,'Graduate Preferences'!A210,\"\")","v":""},{"$f":"IF(A209<=NGrad,Process!A209,\"\")","v":""},{"$f":"IF(A209<=NGrad,COUNTIFS('Graduate Preferences'!B210:ZZ210,C209),\"\")","v":""},{"$f":"IF(A209<=NGrad,IF(D209=0,0,MATCH(C209,'Graduate Preferences'!B210:ZZ210,0)),\"\")","v":""},"","","",null,null,null,""]
[207,{"$f":"IF(A210<=NGrad,'Graduate Preferences'!A211,\"\")","v":""},{"$f":"IF(A210<=NGrad,Process!A210,\"\")","v":""},{"$f":"IF(A210<=NGrad,COUNTIFS('Graduate Preferences'!B211:ZZ211,C210),\"\")","v":""},{"$f":"IF(A210<=NGrad,IF(D210=0,0,MATCH(C210,'Graduate Preferences'!B211:ZZ211,0)),\"\")","v":""},"","","",null,null,null,""]
[208,{"$f":"IF(A211<=NGrad,'Graduate Preferences'!A212,\"\")","v":""},{"$f":"IF(A211<=NGrad,Process!A211,\"\")","v":""},{"$f":"IF(A211<=NGrad,COUNTIFS('Graduate Preferences'!B212:ZZ212,C211),\"\")","v":""},{"$f":"IF(A211<=NGrad,IF(D211=0,0,MATCH(C211,'Graduate Preferences'!B212:ZZ212,0)),\"\")","v":""},"","","",null,null,null,""]
[209,{"$f":"IF(A212<=NGrad,'Graduate Preferences'!A213,\"\")","v":""},{"$f":"IF(A212<=NGrad,Process!A212,\"\")","v":""},{"$f":"IF(A212<=NGrad,COUNTIFS('Graduate Preferences'!B213:ZZ213,C212),\"\")","v":""},{"$f":"IF(A212<=NGrad,IF(D212=0,0,MATCH(C212,'Graduate Preferences'!B213:ZZ213,0)),\"\")","v":""},"","","",null,null,null,""]
[210,{"$f":"IF(A213<=NGrad,'Graduate Preferences'!A214,\"\")","v":""},{"$f":"IF(A213<=NGrad,Process!A213,\"\")","v":""},{"$f":"IF(A213<=NGrad,COUNTIFS('Graduate Preferences'!B214:ZZ214,C213),\"\")","v":""},{"$f":"IF(A213<=NGrad,IF(D213=0,0,MATCH(C213,'Graduate Preferences'!B214:ZZ214,0)),\"\")","v":""},"","","",null,null,null,""]
[211,{"$f":"IF(A214<=NGrad,'Graduate Preferences'!A215,\"\")","v":""},{"$f":"IF(A214<=NGrad,Process!A214,\"\")","v":""},{"$f":"IF(A214<=NGrad,COUNTIFS('Graduate Preferences'!B215:ZZ215,C214),\"\")","v":""},{"$f":"IF(A214<=NGrad,IF(D214=0,0,MATCH(C214,'Graduate Preferences'!B215:ZZ215,0)),\"\")","v":""},"","","",null,null,null,""]
[212,{"$f":"IF(A215<=NGrad,'Graduate Preferences'!A216,\"\")","v":""},{"$f":"IF(A215<=NGrad,Process!A215,\"\")","v":""},{"$f":"IF(A215<=NGrad,COUNTIFS('Graduate Preferences'!B216:ZZ216,C215),\"\")","v":""},{"$f":"IF(A215<=NGrad,IF(D215=0,0,MATCH(C215,'Graduate Preferences'!B216:ZZ216,0)),\"\")","v":""},"","","",null,null,null,""]
[213,{"$f":"IF(A216<=NGrad,'Graduate Preferences'!A217,\"\")","v":""},{"$f":"IF(A216<=NGrad,Process!A216,\"\")","v":""},{"$f":"IF(A216<=NGrad,COUNTIFS('Graduate Preferences'!B217:ZZ217,C216),\"\")","v":""},{"$f":"IF(A216<=NGrad,IF(D216=0,0,MATCH(C216,'Graduate Preferences'!B217:ZZ217,0)),\"\")","v":""},"","","",null,null,null,""]
[214,{"$f":"IF(A217<=NGrad,'Graduate Preferences'!A218,\"\")","v":""},{"$f":"IF(A217<=NGrad,Process!A217,\"\")","v":""},{"$f":"IF(A217<=NGrad,COUNTIFS('Graduate Preferences'!B218:ZZ218,C217),\"\")","v":""},{"$f":"IF(A217<=NGrad,IF(D217=0,0,MATCH(C217,'Graduate Preferences'!B218:ZZ218,0)),\"\")","v":""},"","","",null,null,null,""]
[215,{"$f":"IF(A218<=NGrad,'Graduate Preferences'!A219,\"\")","v":""},{"$f":"IF(A218<=NGrad,Process!A218,\"\")","v":""},{"$f":"IF(A218<=NGrad,COUNTIFS('Graduate Preferences'!B219:ZZ219,C218),\"\")","v":""},{"$f":"IF(A218<=NGrad,IF(D218=0,0,MATCH(C218,'Graduate Preferences'!B219:ZZ219,0)),\"\")","v":""},"","","",null,null,null,""]
[216,{"$f":"IF(A219<=NGrad,'Graduate Preferences'!A220,\"\")","v":""},{"$f":"IF(A219<=NGrad,Process!A219,\"\")","v":""},{"$f":"IF(A219<=NGrad,COUNTIFS('Graduate Preferences'!B220:ZZ220,C219),\"\")","v":""},{"$f":"IF(A219<=NGrad,IF(D219=0,0,MATCH(C219,'Graduate Preferences'!B220:ZZ220,0)),\"\")","v":""},"","","",null,null,null,""]
[217,{"$f":"IF(A220<=NGrad,'Graduate Preferences'!A221,\"\")","v":""},{"$f":"IF(A220<=NGrad,Process!A220,\"\")","v":""},{"$f":"IF(A220<=NGrad,COUNTIFS('Graduate Preferences'!B221:ZZ221,C220),\"\")","v":""},{"$f":"IF(A220<=NGrad,IF(D220=0,0,MATCH(C220,'Graduate Preferences'!B221:ZZ221,0)),\"\")","v":""},"","","",null,null,null,""]
[218,{"$f":"IF(A221<=NGrad,'Graduate Preferences'!A222,\"\")","v":""},{"$f":"IF(A221<=NGrad,Process!A221,\"\")","v":""},{"$f":"IF(A221<=NGrad,COUNTIFS('Graduate Preferences'!B222:ZZ222,C221),\"\")","v":""},{"$f":"IF(A221<=NGrad,IF(D221=0,0,MATCH(C221,'Graduate Preferences'!B222:ZZ222,0)),\"\")","v":""},"","","",null,null,null,""]
[219,{"$f":"IF(A222<=NGrad,'Graduate Preferences'!A223,\"\")","v":""},{"$f":"IF(A222<=NGrad,Process!A222,\"\")","v":""},{"$f":"IF(A222<=NGrad,COUNTIFS('Graduate Preferences'!B223:ZZ223,C222),\"\")","v":""},{"$f":"IF(A222<=NGrad,IF(D222=0,0,MATCH(C222,'Graduate Preferences'!B223:ZZ223,0)),\"\")","v":""},"","","",null,null,null,""]
[220,{"$f":"IF(A223<=NGrad,'Graduate Preferences'!A224,\"\")","v":""},{"$f":"IF(A223<=NGrad,Process!A223,\"\")","v":""},{"$f":"IF(A223<=NGrad,COUNTIFS('Graduate Preferences'!B224:ZZ224,C223),\"\")","v":""},{"$f":"IF(A223<=NGrad,IF(D223=0,0,MATCH(C223,'Graduate Preferences'!B224:ZZ224,0)),\"\")","v":""},"","","",null,null,null,""]
[221,{"$f":"IF(A224<=NGrad,'Graduate Preferences'!A225,\"\")","v":""},{"$f":"IF(A224<=NGrad,Process!A224,\"\")","v":""},{"$f":"IF(A224<=NGrad,COUNTIFS('Graduate Preferences'!B225:ZZ225,C224),\"\")","v":""},{"$f":"IF(A224<=NGrad,IF(D224=0,0,MATCH(C224,'Graduate Preferences'!B225:ZZ225,0)),\"\")","v":""},"","","",null,null,null,""]
[222,{"$f":"IF(A225<=NGrad,'Graduate Preferences'!A226,\"\")","v":""},{"$f":"IF(A225<=NGrad,Process!A225,\"\")","v":""},{"$f":"IF(A225<=NGrad,COUNTIFS('Graduate Preferences'!B226:ZZ226,C225),\"\")","v":""},{"$f":"IF(A225<=NGrad,IF(D225=0,0,MATCH(C225,'Graduate Preferences'!B226:ZZ226,0)),\"\")","v":""},"","","",null,null,null,""]
[223,{"$f":"IF(A226<=NGrad,'Graduate Preferences'!A227,\"\")","v":""},{"$f":"IF(A226<=NGrad,Process!A226,\"\")","v":""},{"$f":"IF(A226<=NGrad,COUNTIFS('Graduate Preferences'!B227:ZZ227,C226),\"\")","v":""},{"$f":"IF(A226<=NGrad,IF(D226=0,0,MATCH(C226,'Graduate Preferences'!B227:ZZ227,0)),\"\")","v":""},"","","",null,null,null,""]
[224,{"$f":"IF(A227<=NGrad,'Graduate Preferences'!A228,\"\")","v":""},{"$f":"IF(A227<=NGrad,Process!A227,\"\")","v":""},{"$f":"IF(A227<=NGrad,COUNTIFS('Graduate Preferences'!B228:ZZ228,C227),\"\")","v":""},{"$f":"IF(A227<=NGrad,IF(D227=0,0,MATCH(C227,'Graduate Preferences'!B228:ZZ228,0)),\"\")","v":""},"","","",null,null,null,""]
[225,{"$f":"IF(A228<=NGrad,'Graduate Preferences'!A229,\"\")","v":""},{"$f":"IF(A228<=NGrad,Process!A228,\"\")","v":""},{"$f":"IF(A228<=NGrad,COUNTIFS('Graduate Preferences'!B229:ZZ229,C228),\"\")","v":""},{"$f":"IF(A228<=NGrad,IF(D228=0,0,MATCH(C228,'Graduate Preferences'!B229:ZZ229,0)),\"\")","v":""},"","","",null,null,null,""]
[226,{"$f":"IF(A229<=NGrad,'Graduate Preferences'!A230,\"\")","v":""},{"$f":"IF(A229<=NGrad,Process!A229,\"\")","v":""},{"$f":"IF(A229<=NGrad,COUNTIFS('Graduate Preferences'!B230:ZZ230,C229),\"\")","v":""},{"$f":"IF(A229<=NGrad,IF(D229=0,0,MATCH(C229,'Graduate Preferences'!B230:ZZ230,0)),\"\")","v":""},"","","",null,null,null,""]
[227,{"$f":"IF(A230<=NGrad,'Graduate Preferences'!A231,\"\")","v":""},{"$f":"IF(A230<=NGrad,Process!A230,\"\")","v":""},{"$f":"IF(A230<=NGrad,COUNTIFS('Graduate Preferences'!B231:ZZ231,C230),\"\")","v":""},{"$f":"IF(A230<=NGrad,IF(D230=0,0,MATCH(C230,'Graduate Preferences'!B231:ZZ231,0)),\"\")","v":""},"","","",null,null,null,""]
[228,{"$f":"IF(A231<=NGrad,'Graduate Preferences'!A232,\"\")","v":""},{"$f":"IF(A231<=NGrad,Process!A231,\"\")","v":""},{"$f":"IF(A231<=NGrad,COUNTIFS('Graduate Preferences'!B232:ZZ232,C231),\"\")","v":""},{"$f":"IF(A231<=NGrad,IF(D231=0,0,MATCH(C231,'Graduate Preferences'!B232:ZZ232,0)),\"\")","v":""},"","","",null,null,null,""]
[229,{"$f":"IF(A232<=NGrad,'Graduate Preferences'!A233,\"\")","v":""},{"$f":"IF(A232<=NGrad,Process!A232,\"\")","v":""},{"$f":"IF(A232<=NGrad,COUNTIFS('Graduate Preferences'!B233:ZZ233,C232),\"\")","v":""},{"$f":"IF(A232<=NGrad,IF(D232=0,0,MATCH(C232,'Graduate Preferences'!B233:ZZ233,0)),\"\")","v":""},"","","",null,null,null,""]
[230,{"$f":"IF(A233<=NGrad,'Graduate Preferences'!A234,\"\")","v":""},{"$f":"IF(A233<=NGrad,Process!A233,\"\")","v":""},{"$f":"IF(A233<=NGrad,COUNTIFS('Graduate Preferences'!B234:ZZ234,C233),\"\")","v":""},{"$f":"IF(A233<=NGrad,IF(D233=0,0,MATCH(C233,'Graduate Preferences'!B234:ZZ234,0)),\"\")","v":""},"","","",null,null,null,""]
[231,{"$f":"IF(A234<=NGrad,'Graduate Preferences'!A235,\"\")","v":""},{"$f":"IF(A234<=NGrad,Process!A234,\"\")","v":""},{"$f":"IF(A234<=NGrad,COUNTIFS('Graduate Preferences'!B235:ZZ235,C234),\"\")","v":""},{"$f":"IF(A234<=NGrad,IF(D234=0,0,MATCH(C234,'Graduate Preferences'!B235:ZZ235,0)),\"\")","v":""},"","","",null,null,null,""]
[232,{"$f":"IF(A235<=NGrad,'Graduate Preferences'!A236,\"\")","v":""},{"$f":"IF(A235<=NGrad,Process!A235,\"\")","v":""},{"$f":"IF(A235<=NGrad,COUNTIFS('Graduate Preferences'!B236:ZZ236,C235),\"\")","v":""},{"$f":"IF(A235<=NGrad,IF(D235=0,0,MATCH(C235,'Graduate Preferences'!B236:ZZ236,0)),\"\")","v":""},"","","",null,null,null,""]
[233,{"$f":"IF(A236<=NGrad,'Graduate Preferences'!A237,\"\")","v":""},{"$f":"IF(A236<=NGrad,Process!A236,\"\")","v":""},{"$f":"IF(A236<=NGrad,COUNTIFS('Graduate Preferences'!B237:ZZ237,C236),\"\")","v":""},{"$f":"IF(A236<=NGrad,IF(D236=0,0,MATCH(C236,'Graduate Preferences'!B237:ZZ237,0)),\"\")","v":""},"","","",null,null,null,""]
[234,{"$f":"IF(A237<=NGrad,'Graduate Preferences'!A238,\"\")","v":""},{"$f":"IF(A237<=NGrad,Process!A237,\"\")","v":""},{"$f":"IF(A237<=NGrad,COUNTIFS('Graduate Preferences'!B238:ZZ238,C237),\"\")","v":""},{"$f":"IF(A237<=NGrad,IF(D237=0,0,MATCH(C237,'Graduate Preferences'!B238:ZZ238,0)),\"\")","v":""},"","","",null,null,null,""]
[235,{"$f":"IF(A238<=NGrad,'Graduate Preferences'!A239,\"\")","v":""},{"$f":"IF(A238<=NGrad,Process!A238,\"\")","v":""},{"$f":"IF(A238<=NGrad,COUNTIFS('Graduate Preferences'!B239:ZZ239,C238),\"\")","v":""},{"$f":"IF(A238<=NGrad,IF(D238=0,0,MATCH(C238,'Graduate Preferences'!B239:ZZ239,0)),\"\")","v":""},"","","",null,null,null,""]
[236,{"$f":"IF(A239<=NGrad,'Graduate Preferences'!A240,\"\")","v":""},{"$f":"IF(A239<=NGrad,Process!A239,\"\")","v":""},{"$f":"IF(A239<=NGrad,COUNTIFS('Graduate Preferences'!B240:ZZ240,C239),\"\")","v":""},{"$f":"IF(A239<=NGrad,IF(D239=0,0,MATCH(C239,'Graduate Preferences'!B240:ZZ240,0)),\"\")","v":""},"","","",null,null,null,""]
[237,{"$f":"IF(A240<=NGrad,'Graduate Preferences'!A241,\"\")","v":""},{"$f":"IF(A240<=NGrad,Process!A240,\"\")","v":""},{"$f":"IF(A240<=NGrad,COUNTIFS('Graduate Preferences'!B241:ZZ241,C240),\"\")","v":""},{"$f":"IF(A240<=NGrad,IF(D240=0,0,MATCH(C240,'Graduate Preferences'!B241:ZZ241,0)),\"\")","v":""},"","","",null,null,null,""]
[238,{"$f":"IF(A241<=NGrad,'Graduate Preferences'!A242,\"\")","v":""},{"$f":"IF(A241<=NGrad,Process!A241,\"\")","v":""},{"$f":"IF(A241<=NGrad,COUNTIFS('Graduate Preferences'!B242:ZZ242,C241),\"\")","v":""},{"$f":"IF(A241<=NGrad,IF(D241=0,0,MATCH(C241,'Graduate Preferences'!B242:ZZ242,0)),\"\")","v":""},"","","",null,null,null,""]
[239,{"$f":"IF(A242<=NGrad,'Graduate Preferences'!A243,\"\")","v":""},{"$f":"IF(A242<=NGrad,Process!A242,\"\")","v":""},{"$f":"IF(A242<=NGrad,COUNTIFS('Graduate Preferences'!B243:ZZ243,C242),\"\")","v":""},{"$f":"IF(A242<=NGrad,IF(D242=0,0,MATCH(C242,'Graduate Preferences'!B243:ZZ243,0)),\"\")","v":""},"","","",null,null,null,""]
[240,{"$f":"IF(A243<=NGrad,'Graduate Preferences'!A244,\"\")","v":""},{"$f":"IF(A243<=NGrad,Process!A243,\"\")","v":""},{"$f":"IF(A243<=NGrad,COUNTIFS('Graduate Preferences'!B244:ZZ244,C243),\"\")","v":""},{"$f":"IF(A243<=NGrad,IF(D243=0,0,MATCH(C243,'Graduate Preferences'!B244:ZZ244,0)),\"\")","v":""},"","","",null,null,null,""]
[241,{"$f":"IF(A244<=NGrad,'Graduate Preferences'!A245,\"\")","v":""},{"$f":"IF(A244<=NGrad,Process!A244,\"\")","v":""},{"$f":"IF(A244<=NGrad,COUNTIFS('Graduate Preferences'!B245:ZZ245,C244),\"\")","v":""},{"$f":"IF(A244<=NGrad,IF(D244=0,0,MATCH(C244,'Graduate Preferences'!B245:ZZ245,0)),\"\")","v":""},"","","",null,null,null,""]
[242,{"$f":"IF(A245<=NGrad,'Graduate Preferences'!A246,\"\")","v":""},{"$f":"IF(A245<=NGrad,Process!A245,\"\")","v":""},{"$f":"IF(A245<=NGrad,COUNTIFS('Graduate Preferences'!B246:ZZ246,C245),\"\")","v":""},{"$f":"IF(A245<=NGrad,IF(D245=0,0,MATCH(C245,'Graduate Preferences'!B246:ZZ246,0)),\"\")","v":""},"","","",null,null,null,""]
[243,{"$f":"IF(A246<=NGrad,'Graduate Preferences'!A247,\"\")","v":""},{"$f":"IF(A246<=NGrad,Process!A246,\"\")","v":""},{"$f":"IF(A246<=NGrad,COUNTIFS('Graduate Preferences'!B247:ZZ247,C246),\"\")","v":""},{"$f":"IF(A246<=NGrad,IF(D246=0,0,MATCH(C246,'Graduate Preferences'!B247:ZZ247,0)),\"\")","v":""},"","","",null,null,null,""]
[244,{"$f":"IF(A247<=NGrad,'Graduate Preferences'!A248,\"\")","v":""},{"$f":"IF(A247<=NGrad,Process!A247,\"\")","v":""},{"$f":"IF(A247<=NGrad,COUNTIFS('Graduate Preferences'!B248:ZZ248,C247),\"\")","v":""},{"$f":"IF(A247<=NGrad,IF(D247=0,0,MATCH(C247,'Graduate Preferences'!B248:ZZ248,0)),\"\")","v":""},"","","",null,null,null,""]
[245,{"$f":"IF(A248<=NGrad,'Graduate Preferences'!A249,\"\")","v":""},{"$f":"IF(A248<=NGrad,Process!A248,\"\")","v":""},{"$f":"IF(A248<=NGrad,COUNTIFS('Graduate Preferences'!B249:ZZ249,C248),\"\")","v":""},{"$f":"IF(A248<=NGrad,IF(D248=0,0,MATCH(C248,'Graduate Preferences'!B249:ZZ249,0)),\"\")","v":""},"","","",null,null,null,""]
[246,{"$f":"IF(A249<=NGrad,'Graduate Preferences'!A250,\"\")","v":""},{"$f":"IF(A249<=NGrad,Process!A249,\"\")","v":""},{"$f":"IF(A249<=NGrad,COUNTIFS('Graduate Preferences'!B250:ZZ250,C249),\"\")","v":""},{"$f":"IF(A249<=NGrad,IF(D249=0,0,MATCH(C249,'Graduate Preferences'!B250:ZZ250,0)),\"\")","v":""},"","","",null,null,null,""]
[247,{"$f":"IF(A250<=NGrad,'Graduate Preferences'!A251,\"\")","v":""},{"$f":"IF(A250<=NGrad,Process!A250,\"\")","v":""},{"$f":"IF(A250<=NGrad,COUNTIFS('Graduate Preferences'!B251:ZZ251,C250),\"\")","v":""},{"$f":"IF(A250<=NGrad,IF(D250=0,0,MATCH(C250,'Graduate Preferences'!B251:ZZ251,0)),\"\")","v":""},"","","",null,null,null,""]
[248,{"$f":"IF(A251<=NGrad,'Graduate Preferences'!A252,\"\")","v":""},{"$f":"IF(A251<=NGrad,Process!A251,\"\")","v":""},{"$f":"IF(A251<=NGrad,COUNTIFS('Graduate Preferences'!B252:ZZ252,C251),\"\")","v":""},{"$f":"IF(A251<=NGrad,IF(D251=0,0,MATCH(C251,'Graduate Preferences'!B252:ZZ252,0)),\"\")","v":""},"","","",null,null,null,""]
[249,{"$f":"IF(A252<=NGrad,'Graduate Preferences'!A253,\"\")","v":""},{"$f":"IF(A252<=NGrad,Process!A252,\"\")","v":""},{"$f":"IF(A252<=NGrad,COUNTIFS('Graduate Preferences'!B253:ZZ253,C252),\"\")","v":""},{"$f":"IF(A252<=NGrad,IF(D252=0,0,MATCH(C252,'Graduate Preferences'!B253:ZZ253,0)),\"\")","v":""},"","","",null,null,null,""]
[250,{"$f":"IF(A253<=NGrad,'Graduate Preferences'!A254,\"\")","v":""},{"$f":"IF(A253<=NGrad,Process!A253,\"\")","v":""},{"$f":"IF(A253<=NGrad,COUNTIFS('Graduate Preferences'!B254:ZZ254,C253),\"\")","v":""},{"$f":"IF(A253<=NGrad,IF(D253=0,0,MATCH(C253,'Graduate Preferences'!B254:ZZ254,0)),\"\")","v":""},"","","",null,null,null,""]
[251,{"$f":"IF(A254<=NGrad,'Graduate Preferences'!A255,\"\")","v":""},{"$f":"IF(A254<=NGrad,Process!A254,\"\")","v":""},{"$f":"IF(A254<=NGrad,COUNTIFS('Graduate Preferences'!B255:ZZ255,C254),\"\")","v":""},{"$f":"IF(A254<=NGrad,IF(D254=0,0,MATCH(C254,'Graduate Preferences'!B255:ZZ255,0)),\"\")","v":""},"","","",null,null,null,""]
[252,{"$f":"IF(A255<=NGrad,'Graduate Preferences'!A256,\"\")","v":""},{"$f":"IF(A255<=NGrad,Process!A255,\"\")","v":""},{"$f":"IF(A255<=NGrad,COUNTIFS('Graduate Preferences'!B256:ZZ256,C255),\"\")","v":""},{"$f":"IF(A255<=NGrad,IF(D255=0,0,MATCH(C255,'Graduate Preferences'!B256:ZZ256,0)),\"\")","v":""},"","","",null,null,null,""]
[253,{"$f":"IF(A256<=NGrad,'Graduate Preferences'!A257,\"\")","v":""},{"$f":"IF(A256<=NGrad,Process!A256,\"\")","v":""},{"$f":"IF(A256<=NGrad,COUNTIFS('Graduate Preferences'!B257:ZZ257,C256),\"\")","v":""},{"$f":"IF(A256<=NGrad,IF(D256=0,0,MATCH(C256,'Graduate Preferences'!B257:ZZ257,0)),\"\")","v":""},"","","",null,null,null,""]
[254,{"$f":"IF(A257<=NGrad,'Graduate Preferences'!A258,\"\")","v":""},{"$f":"IF(A257<=NGrad,Process!A257,\"\")","v":""},{"$f":"IF(A257<=NGrad,COUNTIFS('Graduate Preferences'!B258:ZZ258,C257),\"\")","v":""},{"$f":"IF(A257<=NGrad,IF(D257=0,0,MATCH(C257,'Graduate Preferences'!B258:ZZ258,0)),\"\")","v":""},"","","",null,null,null,""]
[255,{"$f":"IF(A258<=NGrad,'Graduate Preferences'!A259,\"\")","v":""},{"$f":"IF(A258<=NGrad,Process!A258,\"\")","v":""},{"$f":"IF(A258<=NGrad,COUNTIFS('Graduate Preferences'!B259:ZZ259,C258),\"\")","v":""},{"$f":"IF(A258<=NGrad,IF(D258=0,0,MATCH(C258,'Graduate Preferences'!B259:ZZ259,0)),\"\")","v":""},"","","",null,null,null,""]
[256,{"$f":"IF(A259<=NGrad,'Graduate Preferences'!A260,\"\")","v":""},{"$f":"IF(A259<=NGrad,Process!A259,\"\")","v":""},{"$f":"IF(A259<=NGrad,COUNTIFS('Graduate Preferences'!B260:ZZ260,C259),\"\")","v":""},{"$f":"IF(A259<=NGrad,IF(D259=0,0,MATCH(C259,'Graduate Preferences'!B260:ZZ260,0)),\"\")","v":""},"","","",null,null,null,""]
[257,{"$f":"IF(A260<=NGrad,'Graduate Preferences'!A261,\"\")","v":""},{"$f":"IF(A260<=NGrad,Process!A260,\"\")","v":""},{"$f":"IF(A260<=NGrad,COUNTIFS('Graduate Preferences'!B261:ZZ261,C260),\"\")","v":""},{"$f":"IF(A260<=NGrad,IF(D260=0,0,MATCH(C260,'Graduate Preferences'!B261:ZZ261,0)),\"\")","v":""},"","","",null,null,null,""]
[258,{"$f":"IF(A261<=NGrad,'Graduate Preferences'!A262,\"\")","v":""},{"$f":"IF(A261<=NGrad,Process!A261,\"\")","v":""},{"$f":"IF(A261<=NGrad,COUNTIFS('Graduate Preferences'!B262:ZZ262,C261),\"\")","v":""},{"$f":"IF(A261<=NGrad,IF(D261=0,0,MATCH(C261,'Graduate Preferences'!B262:ZZ262,0)),\"\")","v":""},"",{"$f":"IF(F261=\"\",\"\",RANK(F261,F$4:F$1000))","v":""},"",null,null,null,{"$f":"IF(MAX(H$4:H$1000)>=A261,MATCH(A261,H$4:H$1000,0),\"\")","v":""}]
[259,{"$f":"IF(A262<=NGrad,'Graduate Preferences'!A263,\"\")","v":""},{"$f":"IF(A262<=NGrad,Process!A262,\"\")","v":""},{"$f":"IF(A262<=NGrad,COUNTIFS('Graduate Preferences'!B263:ZZ263,C262),\"\")","v":""},{"$f":"IF(A262<=NGrad,IF(D262=0,0,MATCH(C262,'Graduate Preferences'!B263:ZZ263,0)),\"\")","v":""},{"$f":"IF(AND(J262<>\"-\",J262>0,I262=F$2),J262,\"\")","v":""},"",{"$f":"IF(F262=\"\",\"\",MAX(G$4:G$1000)-G262+1)","v":""},null,null,null,""]
[260,{"$f":"IF(A263<=NGrad,'Graduate Preferences'!A264,\"\")","v":""},{"$f":"IF(A263<=NGrad,Process!A263,\"\")","v":""},{"$f":"IF(A263<=NGrad,COUNTIFS('Graduate Preferences'!B264:ZZ264,C263),\"\")","v":""},{"$f":"IF(A263<=NGrad,IF(D263=0,0,MATCH(C263,'Graduate Preferences'!B264:ZZ264,0)),\"\")","v":""},"","","",null,null,null,""]
[261,{"$f":"IF(A264<=NGrad,'Graduate Preferences'!A265,\"\")","v":""},{"$f":"IF(A264<=NGrad,Process!A264,\"\")","v":""},{"$f":"IF(A264<=NGrad,COUNTIFS('Graduate Preferences'!B265:ZZ265,C264),\"\")","v":""},{"$f":"IF(A264<=NGrad,IF(D264=0,0,MATCH(C264,'Graduate Preferences'!B265:ZZ265,0)),\"\")","v":""},"","","",null,null,null,""]
[262,{"$f":"IF(A265<=NGrad,'Graduate Preferences'!A266,\"\")","v":""},{"$f":"IF(A265<=NGrad,Process!A265,\"\")","v":""},{"$f":"IF(A265<=NGrad,COUNTIFS('Graduate Preferences'!B266:ZZ266,C265),\"\")","v":""},{"$f":"IF(A265<=NGrad,IF(D265=0,0,MATCH(C265,'Graduate Preferences'!B266:ZZ266,0)),\"\")","v":""},"","","",null,null,null,""]
[263,{"$f":"IF(A266<=NGrad,'Graduate Preferences'!A267,\"\")","v":""},{"$f":"IF(A266<=NGrad,Process!A266,\"\")","v":""},{"$f":"IF(A266<=NGrad,COUNTIFS('Graduate Preferences'!B267:ZZ267,C266),\"\")","v":""},{"$f":"IF(A266<=NGrad,IF(D266=0,0,MATCH(C266,'Graduate Preferences'!B267:ZZ267,0)),\"\")","v":""},"","","",null,null,null,""]
[264,{"$f":"IF(A267<=NGrad,'Graduate Preferences'!A268,\"\")","v":""},{"$f":"IF(A267<=NGrad,Process!A267,\"\")","v":""},{"$f":"IF(A267<=NGrad,COUNTIFS('Graduate Preferences'!B268:ZZ268,C267),\"\")","v":""},{"$f":"IF(A267<=NGrad,IF(D267=0,0,MATCH(C267,'Graduate Preferences'!B268:ZZ268,0)),\"\")","v":""},"","","",null,null,null,""]
[265,{"$f":"IF(A268<=NGrad,'Graduate Preferences'!A269,\"\")","v":""},{"$f":"IF(A268<=NGrad,Process!A268,\"\")","v":""},{"$f":"IF(A268<=NGrad,COUNTIFS('Graduate Preferences'!B269:ZZ269,C268),\"\")","v":""},{"$f":"IF(A268<=NGrad,IF(D268=0,0,MATCH(C268,'Graduate Preferences'!B269:ZZ269,0)),\"\")","v":""},"","","",null,null,null,""]
[266,{"$f":"IF(A269<=NGrad,'Graduate Preferences'!A270,\"\")","v":""},{"$f":"IF(A269<=NGrad,Process!A269,\"\")","v":""},{"$f":"IF(A269<=NGrad,COUNTIFS('Graduate Preferences'!B270:ZZ270,C269),\"\")","v":""},{"$f":"IF(A269<=NGrad,IF(D269=0,0,MATCH(C269,'Graduate Preferences'!B270:ZZ270,0)),\"\")","v":""},"","","",null,null,null,""]
[267,{"$f":"IF(A270<=NGrad,'Graduate Preferences'!A271,\"\")","v":""},{"$f":"IF(A270<=NGrad,Process!A270,\"\")","v":""},{"$f":"IF(A270<=NGrad,COUNTIFS('Graduate Preferences'!B271:ZZ271,C270),\"\")","v":""},{"$f":"IF(A270<=NGrad,IF(D270=0,0,MATCH(C270,'Graduate Preferences'!B271:ZZ271,0)),\"\")","v":""},"","","",null,null,null,""]
[268,{"$f":"IF(A271<=NGrad,'Graduate Preferences'!A272,\"\")","v":""},{"$f":"IF(A271<=NGrad,Process!A271,\"\")","v":""},{"$f":"IF(A271<=NGrad,COUNTIFS('Graduate Preferences'!B272:ZZ272,C271),\"\")","v":""},{"$f":"IF(A271<=NGrad,IF(D271=0,0,MATCH(C271,'Graduate Preferences'!B272:ZZ272,0)),\"\")","v":""},"","","",null,null,null,""]
[269,{"$f":"IF(A272<=NGrad,'Graduate Preferences'!A273,\"\")","v":""},{"$f":"IF(A272<=NGrad,Process!A272,\"\")","v":""},{"$f":"IF(A272<=NGrad,COUNTIFS('Graduate Preferences'!B273:ZZ273,C272),\"\")","v":""},{"$f":"IF(A272<=NGrad,IF(D272=0,0,MATCH(C272,'Graduate Preferences'!B273:ZZ273,0)),\"\")","v":""},"","","",null,null,null,""]
[270,{"$f":"IF(A273<=NGrad,'Graduate Preferences'!A274,\"\")","v":""},{"$f":"IF(A273<=NGrad,Process!A273,\"\")","v":""},{"$f":"IF(A273<=NGrad,COUNTIFS('Graduate Preferences'!B274:ZZ274,C273),\"\")","v":""},{"$f":"IF(A273<=NGrad,IF(D273=0,0,MATCH(C273,'Graduate Preferences'!B274:ZZ274,0)),\"\")","v":""},"","","",null,null,null,""]
[271,{"$f":"IF(A274<=NGrad,'Graduate Preferences'!A275,\"\")","v":""},{"$f":"IF(A274<=NGrad,Process!A274,\"\")","v":""},{"$f":"IF(A274<=NGrad,COUNTIFS('Graduate Preferences'!B275:ZZ275,C274),\"\")","v":""},{"$f":"IF(A274<=NGrad,IF(D274=0,0,MATCH(C274,'Graduate Preferences'!B275:ZZ275,0)),\"\")","v":""},"","","",null,null,null,""]
[272,{"$f":"IF(A275<=NGrad,'Graduate Preferences'!A276,\"\")","v":""},{"$f":"IF(A275<=NGrad,Process!A275,\"\")","v":""},{"$f":"IF(A275<=NGrad,COUNTIFS('Graduate Preferences'!B276:ZZ276,C275),\"\")","v":""},{"$f":"IF(A275<=NGrad,IF(D275=0,0,MATCH(C275,'Graduate Preferences'!B276:ZZ276,0)),\"\")","v":""},"","","",null,null,null,""]
[273,{"$f":"IF(A276<=NGrad,'Graduate Preferences'!A277,\"\")","v":""},{"$f":"IF(A276<=NGrad,Process!A276,\"\")","v":""},{"$f":"IF(A276<=NGrad,COUNTIFS('Graduate Preferences'!B277:ZZ277,C276),\"\")","v":""},{"$f":"IF(A276<=NGrad,IF(D276=0,0,MATCH(C276,'Graduate Preferences'!B277:ZZ277,0)),\"\")","v":""},"","","",null,null,null,""]
[274,{"$f":"IF(A277<=NGrad,'Graduate Preferences'!A278,\"\")","v":""},{"$f":"IF(A277<=NGrad,Process!A277,\"\")","v":""},{"$f":"IF(A277<=NGrad,COUNTIFS('Graduate Preferences'!B278:ZZ278,C277),\"\")","v":""},{"$f":"IF(A277<=NGrad,IF(D277=0,0,MATCH(C277,'Graduate Preferences'!B278:ZZ278,0)),\"\")","v":""},"","","",null,null,null,""]
[275,{"$f":"IF(A278<=NGrad,'Graduate Preferences'!A279,\"\")","v":""},{"$f":"IF(A278<=NGrad,Process!A278,\"\")","v":""},{"$f":"IF(A278<=NGrad,COUNTIFS('Graduate Preferences'!B279:ZZ279,C278),\"\")","v":""},{"$f":"IF(A278<=NGrad,IF(D278=0,0,MATCH(C278,'Graduate Preferences'!B279:ZZ279,0)),\"\")","v":""},"","","",null,null,null,""]
[276,{"$f":"IF(A279<=NGrad,'Graduate Preferences'!A280,\"\")","v":""},{"$f":"IF(A279<=NGrad,Process!A279,\"\")","v":""},{"$f":"IF(A279<=NGrad,COUNTIFS('Graduate Preferences'!B280:ZZ280,C279),\"\")","v":""},{"$f":"IF(A279<=NGrad,IF(D279=0,0,MATCH(C279,'Graduate Preferences'!B280:ZZ280,0)),\"\")","v":""},"","","",null,null,null,""]
[277,{"$f":"IF(A280<=NGrad,'Graduate Preferences'!A281,\"\")","v":""},{"$f":"IF(A280<=NGrad,Process!A280,\"\")","v":""},{"$f":"IF(A280<=NGrad,COUNTIFS('Graduate Preferences'!B281:ZZ281,C280),\"\")","v":""},{"$f":"IF(A280<=NGrad,IF(D280=0,0,MATCH(C280,'Graduate Preferences'!B281:ZZ281,0)),\"\")","v":""},"","","",null,null,null,""]
[278,{"$f":"IF(A281<=NGrad,'Graduate Preferences'!A282,\"\")","v":""},{"$f":"IF(A281<=NGrad,Process!A281,\"\")","v":""},{"$f":"IF(A281<=NGrad,COUNTIFS('Graduate Preferences'!B282:ZZ282,C281),\"\")","v":""},{"$f":"IF(A281<=NGrad,IF(D281=0,0,MATCH(C281,'Graduate Preferences'!B282:ZZ282,0)),\"\")","v":""},"","","",null,null,null,""]
[279,{"$f":"IF(A282<=NGrad,'Graduate Preferences'!A283,\"\")","v":""},{"$f":"IF(A282<=NGrad,Process!A282,\"\")","v":""},{"$f":"IF(A282<=NGrad,COUNTIFS('Graduate Preferences'!B283:ZZ283,C282),\"\")","v":""},{"$f":"IF(A282<=NGrad,IF(D282=0,0,MATCH(C282,'Graduate Preferences'!B283:ZZ283,0)),\"\")","v":""},"","","",null,null,null,""]
[280,{"$f":"IF(A283<=NGrad,'Graduate Preferences'!A284,\"\")","v":""},{"$f":"IF(A283<=NGrad,Process!A283,\"\")","v":""},{"$f":"IF(A283<=NGrad,COUNTIFS('Graduate Preferences'!B284:ZZ284,C283),\"\")","v":""},{"$f":"IF(A283<=NGrad,IF(D283=0,0,MATCH(C283,'Graduate Preferences'!B284:ZZ284,0)),\"\")","v":""},"","","",null,null,null,""]
[281,{"$f":"IF(A284<=NGrad,'Graduate Preferences'!A285,\"\")","v":""},{"$f":"IF(A284<=NGrad,Process!A284,\"\")","v":""},{"$f":"IF(A284<=NGrad,COUNTIFS('Graduate Preferences'!B285:ZZ285,C284),\"\")","v":""},{"$f":"IF(A284<=NGrad,IF(D284=0,0,MATCH(C284,'Graduate Preferences'!B285:ZZ285,0)),\"\")","v":""},"","","",null,null,null,""]
[282,{"$f":"IF(A285<=NGrad,'Graduate Preferences'!A286,\"\")","v":""},{"$f":"IF(A285<=NGrad,Process!A285,\"\")","v":""},{"$f":"IF(A285<=NGrad,COUNTIFS('Graduate Preferences'!B286:ZZ286,C285),\"\")","v":""},{"$f":"IF(A285<=NGrad,IF(D285=0,0,MATCH(C285,'Graduate Preferences'!B286:ZZ286,0)),\"\")","v":""},"","","",null,null,null,""]
[283,{"$f":"IF(A286<=NGrad,'Graduate Preferences'!A287,\"\")","v":""},{"$f":"IF(A286<=NGrad,Process!A286,\"\")","v":""},{"$f":"IF(A286<=NGrad,COUNTIFS('Graduate Preferences'!B287:ZZ287,C286),\"\")","v":""},{"$f":"IF(A286<=NGrad,IF(D286=0,0,MATCH(C286,'Graduate Preferences'!B287:ZZ287,0)),\"\")","v":""},"","","",null,null,null,""]
[284,{"$f":"IF(A287<=NGrad,'Graduate Preferences'!A288,\"\")","v":""},{"$f":"IF(A287<=NGrad,Process!A287,\"\")","v":""},{"$f":"IF(A287<=NGrad,COUNTIFS('Graduate Preferences'!B288:ZZ288,C287),\"\")","v":""},{"$f":"IF(A287<=NGrad,IF(D287=0,0,MATCH(C287,'Graduate Preferences'!B288:ZZ288,0)),\"\")","v":""},"","","",null,null,null,""]
[285,{"$f":"IF(A288<=NGrad,'Graduate Preferences'!A289,\"\")","v":""},{"$f":"IF(A288<=NGrad,Process!A288,\"\")","v":""},{"$f":"IF(A288<=NGrad,COUNTIFS('Graduate Preferences'!B289:ZZ289,C288),\"\")","v":""},{"$f":"IF(A288<=NGrad,IF(D288=0,0,MATCH(C288,'Graduate Preferences'!B289:ZZ289,0)),\"\")","v":""},"","","",null,null,null,""]
[286,{"$f":"IF(A289<=NGrad,'Graduate Preferences'!A290,\"\")","v":""},{"$f":"IF(A289<=NGrad,Process!A289,\"\")","v":""},{"$f":"IF(A289<=NGrad,COUNTIFS('Graduate Preferences'!B290:ZZ290,C289),\"\")","v":""},{"$f":"IF(A289<=NGrad,IF(D289=0,0,MATCH(C289,'Graduate Preferences'!B290:ZZ290,0)),\"\")","v":""},"","","",null,null,null,""]
[287,{"$f":"IF(A290<=NGrad,'Graduate Preferences'!A291,\"\")","v":""},{"$f":"IF(A290<=NGrad,Process!A290,\"\")","v":""},{"$f":"IF(A290<=NGrad,COUNTIFS('Graduate Preferences'!B291:ZZ291,C290),\"\")","v":""},{"$f":"IF(A290<=NGrad,IF(D290=0,0,MATCH(C290,'Graduate Preferences'!B291:ZZ291,0)),\"\")","v":""},"","","",null,null,null,""]
[288,{"$f":"IF(A291<=NGrad,'Graduate Preferences'!A292,\"\")","v":""},{"$f":"IF(A291<=NGrad,Process!A291,\"\")","v":""},{"$f":"IF(A291<=NGrad,COUNTIFS('Graduate Preferences'!B292:ZZ292,C291),\"\")","v":""},{"$f":"IF(A291<=NGrad,IF(D291=0,0,MATCH(C291,'Graduate Preferences'!B292:ZZ292,0)),\"\")","v":""},"","","",null,null,null,""]
[289,{"$f":"IF(A292<=NGrad,'Graduate Preferences'!A293,\"\")","v":""},{"$f":"IF(A292<=NGrad,Process!A292,\"\")","v":""},{"$f":"IF(A292<=NGrad,COUNTIFS('Graduate Preferences'!B293:ZZ293,C292),\"\")","v":""},{"$f":"IF(A292<=NGrad,IF(D292=0,0,MATCH(C292,'Graduate Preferences'!B293:ZZ293,0)),\"\")","v":""},"","","",null,null,null,""]
[290,{"$f":"IF(A293<=NGrad,'Graduate Preferences'!A294,\"\")","v":""},{"$f":"IF(A293<=NGrad,Process!A293,\"\")","v":""},{"$f":"IF(A293<=NGrad,COUNTIFS('Graduate Preferences'!B294:ZZ294,C293),\"\")","v":""},{"$f":"IF(A293<=NGrad,IF(D293=0,0,MATCH(C293,'Graduate Preferences'!B294:ZZ294,0)),\"\")","v":""},"","","",null,null,null,""]
[291,{"$f":"IF(A294<=NGrad,'Graduate Preferences'!A295,\"\")","v":""},{"$f":"IF(A294<=NGrad,Process!A294,\"\")","v":""},{"$f":"IF(A294<=NGrad,COUNTIFS('Graduate Preferences'!B295:ZZ295,C294),\"\")","v":""},{"$f":"IF(A294<=NGrad,IF(D294=0,0,MATCH(C294,'Graduate Preferences'!B295:ZZ295,0)),\"\")","v":""},"","","",null,null,null,""]
[292,{"$f":"IF(A295<=NGrad,'Graduate Preferences'!A296,\"\")","v":""},{"$f":"IF(A295<=NGrad,Process!A295,\"\")","v":""},{"$f":"IF(A295<=NGrad,COUNTIFS('Graduate Preferences'!B296:ZZ296,C295),\"\")","v":""},{"$f":"IF(A295<=NGrad,IF(D295=0,0,MATCH(C295,'Graduate Preferences'!B296:ZZ296,0)),\"\")","v":""},"","","",null,null,null,""]
[293,{"$f":"IF(A296<=NGrad,'Graduate Preferences'!A297,\"\")","v":""},{"$f":"IF(A296<=NGrad,Process!A296,\"\")","v":""},{"$f":"IF(A296<=NGrad,COUNTIFS('Graduate Preferences'!B297:ZZ297,C296),\"\")","v":""},{"$f":"IF(A296<=NGrad,IF(D296=0,0,MATCH(C296,'Graduate Preferences'!B297:ZZ297,0)),\"\")","v":""},"","","",null,null,null,""]
[294,{"$f":"IF(A297<=NGrad,'Graduate Preferences'!A298,\"\")","v":""},{"$f":"IF(A297<=NGrad,Process!A297,\"\")","v":""},{"$f":"IF(A297<=NGrad,COUNTIFS('Graduate Preferences'!B298:ZZ298,C297),\"\")","v":""},{"$f":"IF(A297<=NGrad,IF(D297=0,0,MATCH(C297,'Graduate Preferences'!B298:ZZ298,0)),\"\")","v":""},"","","",null,null,null,""]
[295,{"$f":"IF(A298<=NGrad,'Graduate Preferences'!A299,\"\")","v":""},{"$f":"IF(A298<=NGrad,Process!A298,\"\")","v":""},{"$f":"IF(A298<=NGrad,COUNTIFS('Graduate Preferences'!B299:ZZ299,C298),\"\")","v":""},{"$f":"IF(A298<=NGrad,IF(D298=0,0,MATCH(C298,'Graduate Preferences'!B299:ZZ299,0)),\"\")","v":""},"","","",null,null,null,""]
[296,{"$f":"IF(A299<=NGrad,'Graduate Preferences'!A300,\"\")","v":""},{"$f":"IF(A299<=NGrad,Process!A299,\"\")","v":""},{"$f":"IF(A299<=NGrad,COUNTIFS('Graduate Preferences'!B300:ZZ300,C299),\"\")","v":""},{"$f":"IF(A299<=NGrad,IF(D299=0,0,MATCH(C299,'Graduate Preferences'!B300:ZZ300,0)),\"\")","v":""},"","","",null,null,null,""]
[297,{"$f":"IF(A300<=NGrad,'Graduate Preferences'!A301,\"\")","v":""},{"$f":"IF(A300<=NGrad,Process!A300,\"\")","v":""},{"$f":"IF(A300<=NGrad,COUNTIFS('Graduate Preferences'!B301:ZZ301,C300),\"\")","v":""},{"$f":"IF(A300<=NGrad,IF(D300=0,0,MATCH(C300,'Graduate Preferences'!B301:ZZ301,0)),\"\")","v":""},"","","",null,null,null,""]
[298,{"$f":"IF(A301<=NGrad,'Graduate Preferences'!A302,\"\")","v":""},{"$f":"IF(A301<=NGrad,Process!A301,\"\")","v":""},{"$f":"IF(A301<=NGrad,COUNTIFS('Graduate Preferences'!B302:ZZ302,C301),\"\")","v":""},{"$f":"IF(A301<=NGrad,IF(D301=0,0,MATCH(C301,'Graduate Preferences'!B302:ZZ302,0)),\"\")","v":""},"","","",null,null,null,""]
[299,{"$f":"IF(A302<=NGrad,'Graduate Preferences'!A303,\"\")","v":""},{"$f":"IF(A302<=NGrad,Process!A302,\"\")","v":""},{"$f":"IF(A302<=NGrad,COUNTIFS('Graduate Preferences'!B303:ZZ303,C302),\"\")","v":""},{"$f":"IF(A302<=NGrad,IF(D302=0,0,MATCH(C302,'Graduate Preferences'!B303:ZZ303,0)),\"\")","v":""},"","","",null,null,null,""]
[300,{"$f":"IF(A303<=NGrad,'Graduate Preferences'!A304,\"\")","v":""},{"$f":"IF(A303<=NGrad,Process!A303,\"\")","v":""},{"$f":"IF(A303<=NGrad,COUNTIFS('Graduate Preferences'!B304:ZZ304,C303),\"\")","v":""},{"$f":"IF(A303<=NGrad,IF(D303=0,0,MATCH(C303,'Graduate Preferences'!B304:ZZ304,0)),\"\")","v":""},"","","",null,null,null,""]
[301,{"$f":"IF(A304<=NGrad,'Graduate Preferences'!A305,\"\")","v":""},{"$f":"IF(A304<=NGrad,Process!A304,\"\")","v":""},{"$f":"IF(A304<=NGrad,COUNTIFS('Graduate Preferences'!B305:ZZ305,C304),\"\")","v":""},{"$f":"IF(A304<=NGrad,IF(D304=0,0,MATCH(C304,'Graduate Preferences'!B305:ZZ305,0)),\"\")","v":""},"","","",null,null,null,""]
[302,{"$f":"IF(A305<=NGrad,'Graduate Preferences'!A306,\"\")","v":""},{"$f":"IF(A305<=NGrad,Process!A305,\"\")","v":""},{"$f":"IF(A305<=NGrad,COUNTIFS('Graduate Preferences'!B306:ZZ306,C305),\"\")","v":""},{"$f":"IF(A305<=NGrad,IF(D305=0,0,MATCH(C305,'Graduate Preferences'!B306:ZZ306,0)),\"\")","v":""},"","","",null,null,null,""]
[303,{"$f":"IF(A306<=NGrad,'Graduate Preferences'!A307,\"\")","v":""},{"$f":"IF(A306<=NGrad,Process!A306,\"\")","v":""},{"$f":"IF(A306<=NGrad,COUNTIFS('Graduate Preferences'!B307:ZZ307,C306),\"\")","v":""},{"$f":"IF(A306<=NGrad,IF(D306=0,0,MATCH(C306,'Graduate Preferences'!B307:ZZ307,0)),\"\")","v":""},"","","",null,null,null,""]
[304,{"$f":"IF(A307<=NGrad,'Graduate Preferences'!A308,\"\")","v":""},{"$f":"IF(A307<=NGrad,Process!A307,\"\")","v":""},{"$f":"IF(A307<=NGrad,COUNTIFS('Graduate Preferences'!B308:ZZ308,C307),\"\")","v":""},{"$f":"IF(A307<=NGrad,IF(D307=0,0,MATCH(C307,'Graduate Preferences'!B308:ZZ308,0)),\"\")","v":""},"","","",null,null,null,""]
[305,{"$f":"IF(A308<=NGrad,'Graduate Preferences'!A309,\"\")","v":""},{"$f":"IF(A308<=NGrad,Process!A308,\"\")","v":""},{"$f":"IF(A308<=NGrad,COUNTIFS('Graduate Preferences'!B309:ZZ309,C308),\"\")","v":""},{"$f":"IF(A308<=NGrad,IF(D308=0,0,MATCH(C308,'Graduate Preferences'!B309:ZZ309,0)),\"\")","v":""},"","","",null,null,null,""]
[306,{"$f":"IF(A309<=NGrad,'Graduate Preferences'!A310,\"\")","v":""},{"$f":"IF(A309<=NGrad,Process!A309,\"\")","v":""},{"$f":"IF(A309<=NGrad,COUNTIFS('Graduate Preferences'!B310:ZZ310,C309),\"\")","v":""},{"$f":"IF(A309<=NGrad,IF(D309=0,0,MATCH(C309,'Graduate Preferences'!B310:ZZ310,0)),\"\")","v":""},"","","",null,null,null,""]
[307,{"$f":"IF(A310<=NGrad,'Graduate Preferences'!A311,\"\")","v":""},{"$f":"IF(A310<=NGrad,Process!A310,\"\")","v":""},{"$f":"IF(A310<=NGrad,COUNTIFS('Graduate Preferences'!B311:ZZ311,C310),\"\")","v":""},{"$f":"IF(A310<=NGrad,IF(D310=0,0,MATCH(C310,'Graduate Preferences'!B311:ZZ311,0)),\"\")","v":""},"","","",null,null,null,""]
[308,{"$f":"IF(A311<=NGrad,'Graduate Preferences'!A312,\"\")","v":""},{"$f":"IF(A311<=NGrad,Process!A311,\"\")","v":""},{"$f":"IF(A311<=NGrad,COUNTIFS('Graduate Preferences'!B312:ZZ312,C311),\"\")","v":""},{"$f":"IF(A311<=NGrad,IF(D311=0,0,MATCH(C311,'Graduate Preferences'!B312:ZZ312,0)),\"\")","v":""},"","","",null,null,null,""]
[309,{"$f":"IF(A312<=NGrad,'Graduate Preferences'!A313,\"\")","v":""},{"$f":"IF(A312<=NGrad,Process!A312,\"\")","v":""},{"$f":"IF(A312<=NGrad,COUNTIFS('Graduate Preferences'!B313:ZZ313,C312),\"\")","v":""},{"$f":"IF(A312<=NGrad,IF(D312=0,0,MATCH(C312,'Graduate Preferences'!B313:ZZ313,0)),\"\")","v":""},"","","",null,null,null,""]
[310,{"$f":"IF(A313<=NGrad,'Graduate Preferences'!A314,\"\")","v":""},{"$f":"IF(A313<=NGrad,Process!A313,\"\")","v":""},{"$f":"IF(A313<=NGrad,COUNTIFS('Graduate Preferences'!B314:ZZ314,C313),\"\")","v":""},{"$f":"IF(A313<=NGrad,IF(D313=0,0,MATCH(C313,'Graduate Preferences'!B314:ZZ314,0)),\"\")","v":""},"","","",null,null,null,""]
[311,{"$f":"IF(A314<=NGrad,'Graduate Preferences'!A315,\"\")","v":""},{"$f":"IF(A314<=NGrad,Process!A314,\"\")","v":""},{"$f":"IF(A314<=NGrad,COUNTIFS('Graduate Preferences'!B315:ZZ315,C314),\"\")","v":""},{"$f":"IF(A314<=NGrad,IF(D314=0,0,MATCH(C314,'Graduate Preferences'!B315:ZZ315,0)),\"\")","v":""},"","","",null,null,null,""]
[312,{"$f":"IF(A315<=NGrad,'Graduate Preferences'!A316,\"\")","v":""},{"$f":"IF(A315<=NGrad,Process!A315,\"\")","v":""},{"$f":"IF(A315<=NGrad,COUNTIFS('Graduate Preferences'!B316:ZZ316,C315),\"\")","v":""},{"$f":"IF(A315<=NGrad,IF(D315=0,0,MATCH(C315,'Graduate Preferences'!B316:ZZ316,0)),\"\")","v":""},"","","",null,null,null,""]
[313,{"$f":"IF(A316<=NGrad,'Graduate Preferences'!A317,\"\")","v":""},{"$f":"IF(A316<=NGrad,Process!A316,\"\")","v":""},{"$f":"IF(A316<=NGrad,COUNTIFS('Graduate Preferences'!B317:ZZ317,C316),\"\")","v":""},{"$f":"IF(A316<=NGrad,IF(D316=0,0,MATCH(C316,'Graduate Preferences'!B317:ZZ317,0)),\"\")","v":""},"","","",null,null,null,""]
[314,{"$f":"IF(A317<=NGrad,'Graduate Preferences'!A318,\"\")","v":""},{"$f":"IF(A317<=NGrad,Process!A317,\"\")","v":""},{"$f":"IF(A317<=NGrad,COUNTIFS('Graduate Preferences'!B318:ZZ318,C317),\"\")","v":""},{"$f":"IF(A317<=NGrad,IF(D317=0,0,MATCH(C317,'Graduate Preferences'!B318:ZZ318,0)),\"\")","v":""},"","","",null,null,null,""]
[315,{"$f":"IF(A318<=NGrad,'Graduate Preferences'!A319,\"\")","v":""},{"$f":"IF(A318<=NGrad,Process!A318,\"\")","v":""},{"$f":"IF(A318<=NGrad,COUNTIFS('Graduate Preferences'!B319:ZZ319,C318),\"\")","v":""},{"$f":"IF(A318<=NGrad,IF(D318=0,0,MATCH(C318,'Graduate Preferences'!B319:ZZ319,0)),\"\")","v":""},"","","",null,null,null,""]
[316,{"$f":"IF(A319<=NGrad,'Graduate Preferences'!A320,\"\")","v":""},{"$f":"IF(A319<=NGrad,Process!A319,\"\")","v":""},{"$f":"IF(A319<=NGrad,COUNTIFS('Graduate Preferences'!B320:ZZ320,C319),\"\")","v":""},{"$f":"IF(A319<=NGrad,IF(D319=0,0,MATCH(C319,'Graduate Preferences'!B320:ZZ320,0)),\"\")","v":""},"","","",null,null,null,""]
[317,{"$f":"IF(A320<=NGrad,'Graduate Preferences'!A321,\"\")","v":""},{"$f":"IF(A320<=NGrad,Process!A320,\"\")","v":""},{"$f":"IF(A320<=NGrad,COUNTIFS('Graduate Preferences'!B321:ZZ321,C320),\"\")","v":""},{"$f":"IF(A320<=NGrad,IF(D320=0,0,MATCH(C320,'Graduate Preferences'!B321:ZZ321,0)),\"\")","v":""},"","","",null,null,null,""]
[318,{"$f":"IF(A321<=NGrad,'Graduate Preferences'!A322,\"\")","v":""},{"$f":"IF(A321<=NGrad,Process!A321,\"\")","v":""},{"$f":"IF(A321<=NGrad,COUNTIFS('Graduate Preferences'!B322:ZZ322,C321),\"\")","v":""},{"$f":"IF(A321<=NGrad,IF(D321=0,0,MATCH(C321,'Graduate Preferences'!B322:ZZ322,0)),\"\")","v":""},"","","",null,null,null,""]
[319,{"$f":"IF(A322<=NGrad,'Graduate Preferences'!A323,\"\")","v":""},{"$f":"IF(A322<=NGrad,Process!A322,\"\")","v":""},{"$f":"IF(A322<=NGrad,COUNTIFS('Graduate Preferences'!B323:ZZ323,C322),\"\")","v":""},{"$f":"IF(A322<=NGrad,IF(D322=0,0,MATCH(C322,'Graduate Preferences'!B323:ZZ323,0)),\"\")","v":""},"","","",null,null,null,""]
[320,{"$f":"IF(A323<=NGrad,'Graduate Preferences'!A324,\"\")","v":""},{"$f":"IF(A323<=NGrad,Process!A323,\"\")","v":""},{"$f":"IF(A323<=NGrad,COUNTIFS('Graduate Preferences'!B324:ZZ324,C323),\"\")","v":""},{"$f":"IF(A323<=NGrad,IF(D323=0,0,MATCH(C323,'Graduate Preferences'!B324:ZZ324,0)),\"\")","v":""},"","","",null,null,null,""]
[321,{"$f":"IF(A324<=NGrad,'Graduate Preferences'!A325,\"\")","v":""},{"$f":"IF(A324<=NGrad,Process!A324,\"\")","v":""},{"$f":"IF(A324<=NGrad,COUNTIFS('Graduate Preferences'!B325:ZZ325,C324),\"\")","v":""},{"$f":"IF(A324<=NGrad,IF(D324=0,0,MATCH(C324,'Graduate Preferences'!B325:ZZ325,0)),\"\")","v":""},"","","",null,null,null,""]
[322,{"$f":"IF(A325<=NGrad,'Graduate Preferences'!A326,\"\")","v":""},{"$f":"IF(A325<=NGrad,Process!A325,\"\")","v":""},{"$f":"IF(A325<=NGrad,COUNTIFS('Graduate Preferences'!B326:ZZ326,C325),\"\")","v":""},{"$f":"IF(A325<=NGrad,IF(D325=0,0,MATCH(C325,'Graduate Preferences'!B326:ZZ326,0)),\"\")","v":""},"",{"$f":"IF(F325=\"\",\"\",RANK(F325,F$4:F$1000))","v":""},"",null,null,null,{"$f":"IF(MAX(H$4:H$1000)>=A325,MATCH(A325,H$4:H$1000,0),\"\")","v":""}]
[323,{"$f":"IF(A326<=NGrad,'Graduate Preferences'!A327,\"\")","v":""},{"$f":"IF(A326<=NGrad,Process!A326,\"\")","v":""},{"$f":"IF(A326<=NGrad,COUNTIFS('Graduate Preferences'!B327:ZZ327,C326),\"\")","v":""},{"$f":"IF(A326<=NGrad,IF(D326=0,0,MATCH(C326,'Graduate Preferences'!B327:ZZ327,0)),\"\")","v":""},{"$f":"IF(AND(J326<>\"-\",J326>0,I326=F$2),J326,\"\")","v":""},"",{"$f":"IF(F326=\"\",\"\",MAX(G$4:G$1000)-G326+1)","v":""},null,null,null,""]
[324,{"$f":"IF(A327<=NGrad,'Graduate Preferences'!A328,\"\")","v":""},{"$f":"IF(A327<=NGrad,Process!A327,\"\")","v":""},{"$f":"IF(A327<=NGrad,COUNTIFS('Graduate Preferences'!B328:ZZ328,C327),\"\")","v":""},{"$f":"IF(A327<=NGrad,IF(D327=0,0,MATCH(C327,'Graduate Preferences'!B328:ZZ328,0)),\"\")","v":""},"","","",null,null,null,""]
[325,{"$f":"IF(A328<=NGrad,'Graduate Preferences'!A329,\"\")","v":""},{"$f":"IF(A328<=NGrad,Process!A328,\"\")","v":""},{"$f":"IF(A328<=NGrad,COUNTIFS('Graduate Preferences'!B329:ZZ329,C328),\"\")","v":""},{"$f":"IF(A328<=NGrad,IF(D328=0,0,MATCH(C328,'Graduate Preferences'!B329:ZZ329,0)),\"\")","v":""},"","","",null,null,null,""]
[326,{"$f":"IF(A329<=NGrad,'Graduate Preferences'!A330,\"\")","v":""},{"$f":"IF(A329<=NGrad,Process!A329,\"\")","v":""},{"$f":"IF(A329<=NGrad,COUNTIFS('Graduate Preferences'!B330:ZZ330,C329),\"\")","v":""},{"$f":"IF(A329<=NGrad,IF(D329=0,0,MATCH(C329,'Graduate Preferences'!B330:ZZ330,0)),\"\")","v":""},"","","",null,null,null,""]
[327,{"$f":"IF(A330<=NGrad,'Graduate Preferences'!A331,\"\")","v":""},{"$f":"IF(A330<=NGrad,Process!A330,\"\")","v":""},{"$f":"IF(A330<=NGrad,COUNTIFS('Graduate Preferences'!B331:ZZ331,C330),\"\")","v":""},{"$f":"IF(A330<=NGrad,IF(D330=0,0,MATCH(C330,'Graduate Preferences'!B331:ZZ331,0)),\"\")","v":""},"","","",null,null,null,""]
[328,{"$f":"IF(A331<=NGrad,'Graduate Preferences'!A332,\"\")","v":""},{"$f":"IF(A331<=NGrad,Process!A331,\"\")","v":""},{"$f":"IF(A331<=NGrad,COUNTIFS('Graduate Preferences'!B332:ZZ332,C331),\"\")","v":""},{"$f":"IF(A331<=NGrad,IF(D331=0,0,MATCH(C331,'Graduate Preferences'!B332:ZZ332,0)),\"\")","v":""},"","","",null,null,null,""]
[329,{"$f":"IF(A332<=NGrad,'Graduate Preferences'!A333,\"\")","v":""},{"$f":"IF(A332<=NGrad,Process!A332,\"\")","v":""},{"$f":"IF(A332<=NGrad,COUNTIFS('Graduate Preferences'!B333:ZZ333,C332),\"\")","v":""},{"$f":"IF(A332<=NGrad,IF(D332=0,0,MATCH(C332,'Graduate Preferences'!B333:ZZ333,0)),\"\")","v":""},"","","",null,null,null,""]
[330,{"$f":"IF(A333<=NGrad,'Graduate Preferences'!A334,\"\")","v":""},{"$f":"IF(A333<=NGrad,Process!A333,\"\")","v":""},{"$f":"IF(A333<=NGrad,COUNTIFS('Graduate Preferences'!B334:ZZ334,C333),\"\")","v":""},{"$f":"IF(A333<=NGrad,IF(D333=0,0,MATCH(C333,'Graduate Preferences'!B334:ZZ334,0)),\"\")","v":""},"","","",null,null,null,""]
[331,{"$f":"IF(A334<=NGrad,'Graduate Preferences'!A335,\"\")","v":""},{"$f":"IF(A334<=NGrad,Process!A334,\"\")","v":""},{"$f":"IF(A334<=NGrad,COUNTIFS('Graduate Preferences'!B335:ZZ335,C334),\"\")","v":""},{"$f":"IF(A334<=NGrad,IF(D334=0,0,MATCH(C334,'Graduate Preferences'!B335:ZZ335,0)),\"\")","v":""},"","","",null,null,null,""]
[332,{"$f":"IF(A335<=NGrad,'Graduate Preferences'!A336,\"\")","v":""},{"$f":"IF(A335<=NGrad,Process!A335,\"\")","v":""},{"$f":"IF(A335<=NGrad,COUNTIFS('Graduate Preferences'!B336:ZZ336,C335),\"\")","v":""},{"$f":"IF(A335<=NGrad,IF(D335=0,0,MATCH(C335,'Graduate Preferences'!B336:ZZ336,0)),\"\")","v":""},"","","",null,null,null,""]
[333,{"$f":"IF(A336<=NGrad,'Graduate Preferences'!A337,\"\")","v":""},{"$f":"IF(A336<=NGrad,Process!A336,\"\")","v":""},{"$f":"IF(A336<=NGrad,COUNTIFS('Graduate Preferences'!B337:ZZ337,C336),\"\")","v":""},{"$f":"IF(A336<=NGrad,IF(D336=0,0,MATCH(C336,'Graduate Preferences'!B337:ZZ337,0)),\"\")","v":""},"","","",null,null,null,""]
[334,{"$f":"IF(A337<=NGrad,'Graduate Preferences'!A338,\"\")","v":""},{"$f":"IF(A337<=NGrad,Process!A337,\"\")","v":""},{"$f":"IF(A337<=NGrad,COUNTIFS('Graduate Preferences'!B338:ZZ338,C337),\"\")","v":""},{"$f":"IF(A337<=NGrad,IF(D337=0,0,MATCH(C337,'Graduate Preferences'!B338:ZZ338,0)),\"\")","v":""},"","","",null,null,null,""]
[335,{"$f":"IF(A338<=NGrad,'Graduate Preferences'!A339,\"\")","v":""},{"$f":"IF(A338<=NGrad,Process!A338,\"\")","v":""},{"$f":"IF(A338<=NGrad,COUNTIFS('Graduate Preferences'!B339:ZZ339,C338),\"\")","v":""},{"$f":"IF(A338<=NGrad,IF(D338=0,0,MATCH(C338,'Graduate Preferences'!B339:ZZ339,0)),\"\")","v":""},"","","",null,null,null,""]
[336,{"$f":"IF(A339<=NGrad,'Graduate Preferences'!A340,\"\")","v":""},{"$f":"IF(A339<=NGrad,Process!A339,\"\")","v":""},{"$f":"IF(A339<=NGrad,COUNTIFS('Graduate Preferences'!B340:ZZ340,C339),\"\")","v":""},{"$f":"IF(A339<=NGrad,IF(D339=0,0,MATCH(C339,'Graduate Preferences'!B340:ZZ340,0)),\"\")","v":""},"","","",null,null,null,""]
[337,{"$f":"IF(A340<=NGrad,'Graduate Preferences'!A341,\"\")","v":""},{"$f":"IF(A340<=NGrad,Process!A340,\"\")","v":""},{"$f":"IF(A340<=NGrad,COUNTIFS('Graduate Preferences'!B341:ZZ341,C340),\"\")","v":""},{"$f":"IF(A340<=NGrad,IF(D340=0,0,MATCH(C340,'Graduate Preferences'!B341:ZZ341,0)),\"\")","v":""},"","","",null,null,null,""]
[338,{"$f":"IF(A341<=NGrad,'Graduate Preferences'!A342,\"\")","v":""},{"$f":"IF(A341<=NGrad,Process!A341,\"\")","v":""},{"$f":"IF(A341<=NGrad,COUNTIFS('Graduate Preferences'!B342:ZZ342,C341),\"\")","v":""},{"$f":"IF(A341<=NGrad,IF(D341=0,0,MATCH(C341,'Graduate Preferences'!B342:ZZ342,0)),\"\")","v":""},"","","",null,null,null,""]
[339,{"$f":"IF(A342<=NGrad,'Graduate Preferences'!A343,\"\")","v":""},{"$f":"IF(A342<=NGrad,Process!A342,\"\")","v":""},{"$f":"IF(A342<=NGrad,COUNTIFS('Graduate Preferences'!B343:ZZ343,C342),\"\")","v":""},{"$f":"IF(A342<=NGrad,IF(D342=0,0,MATCH(C342,'Graduate Preferences'!B343:ZZ343,0)),\"\")","v":""},"","","",null,null,null,""]
[340,{"$f":"IF(A343<=NGrad,'Graduate Preferences'!A344,\"\")","v":""},{"$f":"IF(A343<=NGrad,Process!A343,\"\")","v":""},{"$f":"IF(A343<=NGrad,COUNTIFS('Graduate Preferences'!B344:ZZ344,C343),\"\")","v":""},{"$f":"IF(A343<=NGrad,IF(D343=0,0,MATCH(C343,'Graduate Preferences'!B344:ZZ344,0)),\"\")","v":""},"","","",null,null,null,""]
[341,{"$f":"IF(A344<=NGrad,'Graduate Preferences'!A345,\"\")","v":""},{"$f":"IF(A344<=NGrad,Process!A344,\"\")","v":""},{"$f":"IF(A344<=NGrad,COUNTIFS('Graduate Preferences'!B345:ZZ345,C344),\"\")","v":""},{"$f":"IF(A344<=NGrad,IF(D344=0,0,MATCH(C344,'Graduate Preferences'!B345:ZZ345,0)),\"\")","v":""},"","","",null,null,null,""]
[342,{"$f":"IF(A345<=NGrad,'Graduate Preferences'!A346,\"\")","v":""},{"$f":"IF(A345<=NGrad,Process!A345,\"\")","v":""},{"$f":"IF(A345<=NGrad,COUNTIFS('Graduate Preferences'!B346:ZZ346,C345),\"\")","v":""},{"$f":"IF(A345<=NGrad,IF(D345=0,0,MATCH(C345,'Graduate Preferences'!B346:ZZ346,0)),\"\")","v":""},"","","",null,null,null,""]
[343,{"$f":"IF(A346<=NGrad,'Graduate Preferences'!A347,\"\")","v":""},{"$f":"IF(A346<=NGrad,Process!A346,\"\")","v":""},{"$f":"IF(A346<=NGrad,COUNTIFS('Graduate Preferences'!B347:ZZ347,C346),\"\")","v":""},{"$f":"IF(A346<=NGrad,IF(D346=0,0,MATCH(C346,'Graduate Preferences'!B347:ZZ347,0)),\"\")","v":""},"","","",null,null,null,""]
[344,{"$f":"IF(A347<=NGrad,'Graduate Preferences'!A348,\"\")","v":""},{"$f":"IF(A347<=NGrad,Process!A347,\"\")","v":""},{"$f":"IF(A347<=NGrad,COUNTIFS('Graduate Preferences'!B348:ZZ348,C347),\"\")","v":""},{"$f":"IF(A347<=NGrad,IF(D347=0,0,MATCH(C347,'Graduate Preferences'!B348:ZZ348,0)),\"\")","v":""},"","","",null,null,null,""]
[345,{"$f":"IF(A348<=NGrad,'Graduate Preferences'!A349,\"\")","v":""},{"$f":"IF(A348<=NGrad,Process!A348,\"\")","v":""},{"$f":"IF(A348<=NGrad,COUNTIFS('Graduate Preferences'!B349:ZZ349,C348),\"\")","v":""},{"$f":"IF(A348<=NGrad,IF(D348=0,0,MATCH(C348,'Graduate Preferences'!B349:ZZ349,0)),\"\")","v":""},"","","",null,null,null,""]
[346,{"$f":"IF(A349<=NGrad,'Graduate Preferences'!A350,\"\")","v":""},{"$f":"IF(A349<=NGrad,Process!A349,\"\")","v":""},{"$f":"IF(A349<=NGrad,COUNTIFS('Graduate Preferences'!B350:ZZ350,C349),\"\")","v":""},{"$f":"IF(A349<=NGrad,IF(D349=0,0,MATCH(C349,'Graduate Preferences'!B350:ZZ350,0)),\"\")","v":""},"","","",null,null,null,""]
[347,{"$f":"IF(A350<=NGrad,'Graduate Preferences'!A351,\"\")","v":""},{"$f":"IF(A350<=NGrad,Process!A350,\"\")","v":""},{"$f":"IF(A350<=NGrad,COUNTIFS('Graduate Preferences'!B351:ZZ351,C350),\"\")","v":""},{"$f":"IF(A350<=NGrad,IF(D350=0,0,MATCH(C350,'Graduate Preferences'!B351:ZZ351,0)),\"\")","v":""},"","","",null,null,null,""]
[348,{"$f":"IF(A351<=NGrad,'Graduate Preferences'!A352,\"\")","v":""},{"$f":"IF(A351<=NGrad,Process!A351,\"\")","v":""},{"$f":"IF(A351<=NGrad,COUNTIFS('Graduate Preferences'!B352:ZZ352,C351),\"\")","v":""},{"$f":"IF(A351<=NGrad,IF(D351=0,0,MATCH(C351,'Graduate Preferences'!B352:ZZ352,0)),\"\")","v":""},"","","",null,null,null,""]
[349,{"$f":"IF(A352<=NGrad,'Graduate Preferences'!A353,\"\")","v":""},{"$f":"IF(A352<=NGrad,Process!A352,\"\")","v":""},{"$f":"IF(A352<=NGrad,COUNTIFS('Graduate Preferences'!B353:ZZ353,C352),\"\")","v":""},{"$f":"IF(A352<=NGrad,IF(D352=0,0,MATCH(C352,'Graduate Preferences'!B353:ZZ353,0)),\"\")","v":""},"","","",null,null,null,""]
[350,{"$f":"IF(A353<=NGrad,'Graduate Preferences'!A354,\"\")","v":""},{"$f":"IF(A353<=NGrad,Process!A353,\"\")","v":""},{"$f":"IF(A353<=NGrad,COUNTIFS('Graduate Preferences'!B354:ZZ354,C353),\"\")","v":""},{"$f":"IF(A353<=NGrad,IF(D353=0,0,MATCH(C353,'Graduate Preferences'!B354:ZZ354,0)),\"\")","v":""},"","","",null,null,null,""]
[351,{"$f":"IF(A354<=NGrad,'Graduate Preferences'!A355,\"\")","v":""},{"$f":"IF(A354<=NGrad,Process!A354,\"\")","v":""},{"$f":"IF(A354<=NGrad,COUNTIFS('Graduate Preferences'!B355:ZZ355,C354),\"\")","v":""},{"$f":"IF(A354<=NGrad,IF(D354=0,0,MATCH(C354,'Graduate Preferences'!B355:ZZ355,0)),\"\")","v":""},"","","",null,null,null,""]
[352,{"$f":"IF(A355<=NGrad,'Graduate Preferences'!A356,\"\")","v":""},{"$f":"IF(A355<=NGrad,Process!A355,\"\")","v":""},{"$f":"IF(A355<=NGrad,COUNTIFS('Graduate Preferences'!B356:ZZ356,C355),\"\")","v":""},{"$f":"IF(A355<=NGrad,IF(D355=0,0,MATCH(C355,'Graduate Preferences'!B356:ZZ356,0)),\"\")","v":""},"","","",null,null,null,""]
[353,{"$f":"IF(A356<=NGrad,'Graduate Preferences'!A357,\"\")","v":""},{"$f":"IF(A356<=NGrad,Process!A356,\"\")","v":""},{"$f":"IF(A356<=NGrad,COUNTIFS('Graduate Preferences'!B357:ZZ357,C356),\"\")","v":""},{"$f":"IF(A356<=NGrad,IF(D356=0,0,MATCH(C356,'Graduate Preferences'!B357:ZZ357,0)),\"\")","v":""},"","","",null,null,null,""]
[354,{"$f":"IF(A357<=NGrad,'Graduate Preferences'!A358,\"\")","v":""},{"$f":"IF(A357<=NGrad,Process!A357,\"\")","v":""},{"$f":"IF(A357<=NGrad,COUNTIFS('Graduate Preferences'!B358:ZZ358,C357),\"\")","v":""},{"$f":"IF(A357<=NGrad,IF(D357=0,0,MATCH(C357,'Graduate Preferences'!B358:ZZ358,0)),\"\")","v":""},"","","",null,null,null,""]
[355,{"$f":"IF(A358<=NGrad,'Graduate Preferences'!A359,\"\")","v":""},{"$f":"IF(A358<=NGrad,Process!A358,\"\")","v":""},{"$f":"IF(A358<=NGrad,COUNTIFS('Graduate Preferences'!B359:ZZ359,C358),\"\")","v":""},{"$f":"IF(A358<=NGrad,IF(D358=0,0,MATCH(C358,'Graduate Preferences'!B359:ZZ359,0)),\"\")","v":""},"","","",null,null,null,""]
[356,{"$f":"IF(A359<=NGrad,'Graduate Preferences'!A360,\"\")","v":""},{"$f":"IF(A359<=NGrad,Process!A359,\"\")","v":""},{"$f":"IF(A359<=NGrad,COUNTIFS('Graduate Preferences'!B360:ZZ360,C359),\"\")","v":""},{"$f":"IF(A359<=NGrad,IF(D359=0,0,MATCH(C359,'Graduate Preferences'!B360:ZZ360,0)),\"\")","v":""},"","","",null,null,null,""]
[357,{"$f":"IF(A360<=NGrad,'Graduate Preferences'!A361,\"\")","v":""},{"$f":"IF(A360<=NGrad,Process!A360,\"\")","v":""},{"$f":"IF(A360<=NGrad,COUNTIFS('Graduate Preferences'!B361:ZZ361,C360),\"\")","v":""},{"$f":"IF(A360<=NGrad,IF(D360=0,0,MATCH(C360,'Graduate Preferences'!B361:ZZ361,0)),\"\")","v":""},"","","",null,null,null,""]
[358,{"$f":"IF(A361<=NGrad,'Graduate Preferences'!A362,\"\")","v":""},{"$f":"IF(A361<=NGrad,Process!A361,\"\")","v":""},{"$f":"IF(A361<=NGrad,COUNTIFS('Graduate Preferences'!B362:ZZ362,C361),\"\")","v":""},{"$f":"IF(A361<=NGrad,IF(D361=0,0,MATCH(C361,'Graduate Preferences'!B362:ZZ362,0)),\"\")","v":""},"","","",null,null,null,""]
[359,{"$f":"IF(A362<=NGrad,'Graduate Preferences'!A363,\"\")","v":""},{"$f":"IF(A362<=NGrad,Process!A362,\"\")","v":""},{"$f":"IF(A362<=NGrad,COUNTIFS('Graduate Preferences'!B363:ZZ363,C362),\"\")","v":""},{"$f":"IF(A362<=NGrad,IF(D362=0,0,MATCH(C362,'Graduate Preferences'!B363:ZZ363,0)),\"\")","v":""},"","","",null,null,null,""]
[360,{"$f":"IF(A363<=NGrad,'Graduate Preferences'!A364,\"\")","v":""},{"$f":"IF(A363<=NGrad,Process!A363,\"\")","v":""},{"$f":"IF(A363<=NGrad,COUNTIFS('Graduate Preferences'!B364:ZZ364,C363),\"\")","v":""},{"$f":"IF(A363<=NGrad,IF(D363=0,0,MATCH(C363,'Graduate Preferences'!B364:ZZ364,0)),\"\")","v":""},"","","",null,null,null,""]
[361,{"$f":"IF(A364<=NGrad,'Graduate Preferences'!A365,\"\")","v":""},{"$f":"IF(A364<=NGrad,Process!A364,\"\")","v":""},{"$f":"IF(A364<=NGrad,COUNTIFS('Graduate Preferences'!B365:ZZ365,C364),\"\")","v":""},{"$f":"IF(A364<=NGrad,IF(D364=0,0,MATCH(C364,'Graduate Preferences'!B365:ZZ365,0)),\"\")","v":""},"","","",null,null,null,""]
[362,{"$f":"IF(A365<=NGrad,'Graduate Preferences'!A366,\"\")","v":""},{"$f":"IF(A365<=NGrad,Process!A365,\"\")","v":""},{"$f":"IF(A365<=NGrad,COUNTIFS('Graduate Preferences'!B366:ZZ366,C365),\"\")","v":""},{"$f":"IF(A365<=NGrad,IF(D365=0,0,MATCH(C365,'Graduate Preferences'!B366:ZZ366,0)),\"\")","v":""},"","","",null,null,null,""]
[363,{"$f":"IF(A366<=NGrad,'Graduate Preferences'!A367,\"\")","v":""},{"$f":"IF(A366<=NGrad,Process!A366,\"\")","v":""},{"$f":"IF(A366<=NGrad,COUNTIFS('Graduate Preferences'!B367:ZZ367,C366),\"\")","v":""},{"$f":"IF(A366<=NGrad,IF(D366=0,0,MATCH(C366,'Graduate Preferences'!B367:ZZ367,0)),\"\")","v":""},"","","",null,null,null,""]
[364,{"$f":"IF(A367<=NGrad,'Graduate Preferences'!A368,\"\")","v":""},{"$f":"IF(A367<=NGrad,Process!A367,\"\")","v":""},{"$f":"IF(A367<=NGrad,COUNTIFS('Graduate Preferences'!B368:ZZ368,C367),\"\")","v":""},{"$f":"IF(A367<=NGrad,IF(D367=0,0,MATCH(C367,'Graduate Preferences'!B368:ZZ368,0)),\"\")","v":""},"","","",null,null,null,""]
[365,{"$f":"IF(A368<=NGrad,'Graduate Preferences'!A369,\"\")","v":""},{"$f":"IF(A368<=NGrad,Process!A368,\"\")","v":""},{"$f":"IF(A368<=NGrad,COUNTIFS('Graduate Preferences'!B369:ZZ369,C368),\"\")","v":""},{"$f":"IF(A368<=NGrad,IF(D368=0,0,MATCH(C368,'Graduate Preferences'!B369:ZZ369,0)),\"\")","v":""},"","","",null,null,null,""]
[366,{"$f":"IF(A369<=NGrad,'Graduate Preferences'!A370,\"\")","v":""},{"$f":"IF(A369<=NGrad,Process!A369,\"\")","v":""},{"$f":"IF(A369<=NGrad,COUNTIFS('Graduate Preferences'!B370:ZZ370,C369),\"\")","v":""},{"$f":"IF(A369<=NGrad,IF(D369=0,0,MATCH(C369,'Graduate Preferences'!B370:ZZ370,0)),\"\")","v":""},"","","",null,null,null,""]
[367,{"$f":"IF(A370<=NGrad,'Graduate Preferences'!A371,\"\")","v":""},{"$f":"IF(A370<=NGrad,Process!A370,\"\")","v":""},{"$f":"IF(A370<=NGrad,COUNTIFS('Graduate Preferences'!B371:ZZ371,C370),\"\")","v":""},{"$f":"IF(A370<=NGrad,IF(D370=0,0,MATCH(C370,'Graduate Preferences'!B371:ZZ371,0)),\"\")","v":""},"","","",null,null,null,""]
[368,{"$f":"IF(A371<=NGrad,'Graduate Preferences'!A372,\"\")","v":""},{"$f":"IF(A371<=NGrad,Process!A371,\"\")","v":""},{"$f":"IF(A371<=NGrad,COUNTIFS('Graduate Preferences'!B372:ZZ372,C371),\"\")","v":""},{"$f":"IF(A371<=NGrad,IF(D371=0,0,MATCH(C371,'Graduate Preferences'!B372:ZZ372,0)),\"\")","v":""},"","","",null,null,null,""]
[369,{"$f":"IF(A372<=NGrad,'Graduate Preferences'!A373,\"\")","v":""},{"$f":"IF(A372<=NGrad,Process!A372,\"\")","v":""},{"$f":"IF(A372<=NGrad,COUNTIFS('Graduate Preferences'!B373:ZZ373,C372),\"\")","v":""},{"$f":"IF(A372<=NGrad,IF(D372=0,0,MATCH(C372,'Graduate Preferences'!B373:ZZ373,0)),\"\")","v":""},"","","",null,null,null,""]
[370,{"$f":"IF(A373<=NGrad,'Graduate Preferences'!A374,\"\")","v":""},{"$f":"IF(A373<=NGrad,Process!A373,\"\")","v":""},{"$f":"IF(A373<=NGrad,COUNTIFS('Graduate Preferences'!B374:ZZ374,C373),\"\")","v":""},{"$f":"IF(A373<=NGrad,IF(D373=0,0,MATCH(C373,'Graduate Preferences'!B374:ZZ374,0)),\"\")","v":""},"","","",null,null,null,""]
[371,{"$f":"IF(A374<=NGrad,'Graduate Preferences'!A375,\"\")","v":""},{"$f":"IF(A374<=NGrad,Process!A374,\"\")","v":""},{"$f":"IF(A374<=NGrad,COUNTIFS('Graduate Preferences'!B375:ZZ375,C374),\"\")","v":""},{"$f":"IF(A374<=NGrad,IF(D374=0,0,MATCH(C374,'Graduate Preferences'!B375:ZZ375,0)),\"\")","v":""},"","","",null,null,null,""]
[372,{"$f":"IF(A375<=NGrad,'Graduate Preferences'!A376,\"\")","v":""},{"$f":"IF(A375<=NGrad,Process!A375,\"\")","v":""},{"$f":"IF(A375<=NGrad,COUNTIFS('Graduate Preferences'!B376:ZZ376,C375),\"\")","v":""},{"$f":"IF(A375<=NGrad,IF(D375=0,0,MATCH(C375,'Graduate Preferences'!B376:ZZ376,0)),\"\")","v":""},"","","",null,null,null,""]
[373,{"$f":"IF(A376<=NGrad,'Graduate Preferences'!A377,\"\")","v":""},{"$f":"IF(A376<=NGrad,Process!A376,\"\")","v":""},{"$f":"IF(A376<=NGrad,COUNTIFS('Graduate Preferences'!B377:ZZ377,C376),\"\")","v":""},{"$f":"IF(A376<=NGrad,IF(D376=0,0,MATCH(C376,'Graduate Preferences'!B377:ZZ377,0)),\"\")","v":""},"","","",null,null,null,""]
[374,{"$f":"IF(A377<=NGrad,'Graduate Preferences'!A378,\"\")","v":""},{"$f":"IF(A377<=NGrad,Process!A377,\"\")","v":""},{"$f":"IF(A377<=NGrad,COUNTIFS('Graduate Preferences'!B378:ZZ378,C377),\"\")","v":""},{"$f":"IF(A377<=NGrad,IF(D377=0,0,MATCH(C377,'Graduate Preferences'!B378:ZZ378,0)),\"\")","v":""},"","","",null,null,null,""]
[375,{"$f":"IF(A378<=NGrad,'Graduate Preferences'!A379,\"\")","v":""},{"$f":"IF(A378<=NGrad,Process!A378,\"\")","v":""},{"$f":"IF(A378<=NGrad,COUNTIFS('Graduate Preferences'!B379:ZZ379,C378),\"\")","v":""},{"$f":"IF(A378<=NGrad,IF(D378=0,0,MATCH(C378,'Graduate Preferences'!B379:ZZ379,0)),\"\")","v":""},"","","",null,null,null,""]
[376,{"$f":"IF(A379<=NGrad,'Graduate Preferences'!A380,\"\")","v":""},{"$f":"IF(A379<=NGrad,Process!A379,\"\")","v":""},{"$f":"IF(A379<=NGrad,COUNTIFS('Graduate Preferences'!B380:ZZ380,C379),\"\")","v":""},{"$f":"IF(A379<=NGrad,IF(D379=0,0,MATCH(C379,'Graduate Preferences'!B380:ZZ380,0)),\"\")","v":""},"","","",null,null,null,""]
[377,{"$f":"IF(A380<=NGrad,'Graduate Preferences'!A381,\"\")","v":""},{"$f":"IF(A380<=NGrad,Process!A380,\"\")","v":""},{"$f":"IF(A380<=NGrad,COUNTIFS('Graduate Preferences'!B381:ZZ381,C380),\"\")","v":""},{"$f":"IF(A380<=NGrad,IF(D380=0,0,MATCH(C380,'Graduate Preferences'!B381:ZZ381,0)),\"\")","v":""},"","","",null,null,null,""]
[378,{"$f":"IF(A381<=NGrad,'Graduate Preferences'!A382,\"\")","v":""},{"$f":"IF(A381<=NGrad,Process!A381,\"\")","v":""},{"$f":"IF(A381<=NGrad,COUNTIFS('Graduate Preferences'!B382:ZZ382,C381),\"\")","v":""},{"$f":"IF(A381<=NGrad,IF(D381=0,0,MATCH(C381,'Graduate Preferences'!B382:ZZ382,0)),\"\")","v":""},"","","",null,null,null,""]
[379,{"$f":"IF(A382<=NGrad,'Graduate Preferences'!A383,\"\")","v":""},{"$f":"IF(A382<=NGrad,Process!A382,\"\")","v":""},{"$f":"IF(A382<=NGrad,COUNTIFS('Graduate Preferences'!B383:ZZ383,C382),\"\")","v":""},{"$f":"IF(A382<=NGrad,IF(D382=0,0,MATCH(C382,'Graduate Preferences'!B383:ZZ383,0)),\"\")","v":""},"","","",null,null,null,""]
[380,{"$f":"IF(A383<=NGrad,'Graduate Preferences'!A384,\"\")","v":""},{"$f":"IF(A383<=NGrad,Process!A383,\"\")","v":""},{"$f":"IF(A383<=NGrad,COUNTIFS('Graduate Preferences'!B384:ZZ384,C383),\"\")","v":""},{"$f":"IF(A383<=NGrad,IF(D383=0,0,MATCH(C383,'Graduate Preferences'!B384:ZZ384,0)),\"\")","v":""},"","","",null,null,null,""]
[381,{"$f":"IF(A384<=NGrad,'Graduate Preferences'!A385,\"\")","v":""},{"$f":"IF(A384<=NGrad,Process!A384,\"\")","v":""},{"$f":"IF(A384<=NGrad,COUNTIFS('Graduate Preferences'!B385:ZZ385,C384),\"\")","v":""},{"$f":"IF(A384<=NGrad,IF(D384=0,0,MATCH(C384,'Graduate Preferences'!B385:ZZ385,0)),\"\")","v":""},"","","",null,null,null,""]
[382,{"$f":"IF(A385<=NGrad,'Graduate Preferences'!A386,\"\")","v":""},{"$f":"IF(A385<=NGrad,Process!A385,\"\")","v":""},{"$f":"IF(A385<=NGrad,COUNTIFS('Graduate Preferences'!B386:ZZ386,C385),\"\")","v":""},{"$f":"IF(A385<=NGrad,IF(D385=0,0,MATCH(C385,'Graduate Preferences'!B386:ZZ386,0)),\"\")","v":""},"","","",null,null,null,""]
[383,{"$f":"IF(A386<=NGrad,'Graduate Preferences'!A387,\"\")","v":""},{"$f":"IF(A386<=NGrad,Process!A386,\"\")","v":""},{"$f":"IF(A386<=NGrad,COUNTIFS('Graduate Preferences'!B387:ZZ387,C386),\"\")","v":""},{"$f":"IF(A386<=NGrad,IF(D386=0,0,MATCH(C386,'Graduate Preferences'!B387:ZZ387,0)),\"\")","v":""},"","","",null,null,null,""]
[384,{"$f":"IF(A387<=NGrad,'Graduate Preferences'!A388,\"\")","v":""},{"$f":"IF(A387<=NGrad,Process!A387,\"\")","v":""},{"$f":"IF(A387<=NGrad,COUNTIFS('Graduate Preferences'!B388:ZZ388,C387),\"\")","v":""},{"$f":"IF(A387<=NGrad,IF(D387=0,0,MATCH(C387,'Graduate Preferences'!B388:ZZ388,0)),\"\")","v":""},"","","",null,null,null,""]
[385,{"$f":"IF(A388<=NGrad,'Graduate Preferences'!A389,\"\")","v":""},{"$f":"IF(A388<=NGrad,Process!A388,\"\")","v":""},{"$f":"IF(A388<=NGrad,COUNTIFS('Graduate Preferences'!B389:ZZ389,C388),\"\")","v":""},{"$f":"IF(A388<=NGrad,IF(D388=0,0,MATCH(C388,'Graduate Preferences'!B389:ZZ389,0)),\"\")","v":""},"","","",null,null,null,""]
[386,{"$f":"IF(A389<=NGrad,'Graduate Preferences'!A390,\"\")","v":""},{"$f":"IF(A389<=NGrad,Process!A389,\"\")","v":""},{"$f":"IF(A389<=NGrad,COUNTIFS('Graduate Preferences'!B390:ZZ390,C389),\"\")","v":""},{"$f":"IF(A389<=NGrad,IF(D389=0,0,MATCH(C389,'Graduate Preferences'!B390:ZZ390,0)),\"\")","v":""},"",{"$f":"IF(F389=\"\",\"\",RANK(F389,F$4:F$1000))","v":""},"",null,null,null,{"$f":"IF(MAX(H$4:H$1000)>=A389,MATCH(A389,H$4:H$1000,0),\"\")","v":""}]
[387,{"$f":"IF(A390<=NGrad,'Graduate Preferences'!A391,\"\")","v":""},{"$f":"IF(A390<=NGrad,Process!A390,\"\")","v":""},{"$f":"IF(A390<=NGrad,COUNTIFS('Graduate Preferences'!B391:ZZ391,C390),\"\")","v":""},{"$f":"IF(A390<=NGrad,IF(D390=0,0,MATCH(C390,'Graduate Preferences'!B391:ZZ391,0)),\"\")","v":""},{"$f":"IF(AND(J390<>\"-\",J390>0,I390=F$2),J390,\"\")","v":""},"",{"$f":"IF(F390=\"\",\"\",MAX(G$4:G$1000)-G390+1)","v":""},null,null,null,""]
[388,{"$f":"IF(A391<=NGrad,'Graduate Preferences'!A392,\"\")","v":""},{"$f":"IF(A391<=NGrad,Process!A391,\"\")","v":""},{"$f":"IF(A391<=NGrad,COUNTIFS('Graduate Preferences'!B392:ZZ392,C391),\"\")","v":""},{"$f":"IF(A391<=NGrad,IF(D391=0,0,MATCH(C391,'Graduate Preferences'!B392:ZZ392,0)),\"\")","v":""},"","","",null,null,null,""]
[389,{"$f":"IF(A392<=NGrad,'Graduate Preferences'!A393,\"\")","v":""},{"$f":"IF(A392<=NGrad,Process!A392,\"\")","v":""},{"$f":"IF(A392<=NGrad,COUNTIFS('Graduate Preferences'!B393:ZZ393,C392),\"\")","v":""},{"$f":"IF(A392<=NGrad,IF(D392=0,0,MATCH(C392,'Graduate Preferences'!B393:ZZ393,0)),\"\")","v":""},"","","",null,null,null,""]
[390,{"$f":"IF(A393<=NGrad,'Graduate Preferences'!A394,\"\")","v":""},{"$f":"IF(A393<=NGrad,Process!A393,\"\")","v":""},{"$f":"IF(A393<=NGrad,COUNTIFS('Graduate Preferences'!B394:ZZ394,C393),\"\")","v":""},{"$f":"IF(A393<=NGrad,IF(D393=0,0,MATCH(C393,'Graduate Preferences'!B394:ZZ394,0)),\"\")","v":""},"","","",null,null,null,""]
[391,{"$f":"IF(A394<=NGrad,'Graduate Preferences'!A395,\"\")","v":""},{"$f":"IF(A394<=NGrad,Process!A394,\"\")","v":""},{"$f":"IF(A394<=NGrad,COUNTIFS('Graduate Preferences'!B395:ZZ395,C394),\"\")","v":""},{"$f":"IF(A394<=NGrad,IF(D394=0,0,MATCH(C394,'Graduate Preferences'!B395:ZZ395,0)),\"\")","v":""},"","","",null,null,null,""]
[392,{"$f":"IF(A395<=NGrad,'Graduate Preferences'!A396,\"\")","v":""},{"$f":"IF(A395<=NGrad,Process!A395,\"\")","v":""},{"$f":"IF(A395<=NGrad,COUNTIFS('Graduate Preferences'!B396:ZZ396,C395),\"\")","v":""},{"$f":"IF(A395<=NGrad,IF(D395=0,0,MATCH(C395,'Graduate Preferences'!B396:ZZ396,0)),\"\")","v":""},"","","",null,null,null,""]
[393,{"$f":"IF(A396<=NGrad,'Graduate Preferences'!A397,\"\")","v":""},{"$f":"IF(A396<=NGrad,Process!A396,\"\")","v":""},{"$f":"IF(A396<=NGrad,COUNTIFS('Graduate Preferences'!B397:ZZ397,C396),\"\")","v":""},{"$f":"IF(A396<=NGrad,IF(D396=0,0,MATCH(C396,'Graduate Preferences'!B397:ZZ397,0)),\"\")","v":""},"","","",null,null,null,""]
[394,{"$f":"IF(A397<=NGrad,'Graduate Preferences'!A398,\"\")","v":""},{"$f":"IF(A397<=NGrad,Process!A397,\"\")","v":""},{"$f":"IF(A397<=NGrad,COUNTIFS('Graduate Preferences'!B398:ZZ398,C397),\"\")","v":""},{"$f":"IF(A397<=NGrad,IF(D397=0,0,MATCH(C397,'Graduate Preferences'!B398:ZZ398,0)),\"\")","v":""},"","","",null,null,null,""]
[395,{"$f":"IF(A398<=NGrad,'Graduate Preferences'!A399,\"\")","v":""},{"$f":"IF(A398<=NGrad,Process!A398,\"\")","v":""},{"$f":"IF(A398<=NGrad,COUNTIFS('Graduate Preferences'!B399:ZZ399,C398),\"\")","v":""},{"$f":"IF(A398<=NGrad,IF(D398=0,0,MATCH(C398,'Graduate Preferences'!B399:ZZ399,0)),\"\")","v":""},"","","",null,null,null,""]
[396,{"$f":"IF(A399<=NGrad,'Graduate Preferences'!A400,\"\")","v":""},{"$f":"IF(A399<=NGrad,Process!A399,\"\")","v":""},{"$f":"IF(A399<=NGrad,COUNTIFS('Graduate Preferences'!B400:ZZ400,C399),\"\")","v":""},{"$f":"IF(A399<=NGrad,IF(D399=0,0,MATCH(C399,'Graduate Preferences'!B400:ZZ400,0)),\"\")","v":""},"","","",null,null,null,""]
[397,{"$f":"IF(A400<=NGrad,'Graduate Preferences'!A401,\"\")","v":""},{"$f":"IF(A400<=NGrad,Process!A400,\"\")","v":""},{"$f":"IF(A400<=NGrad,COUNTIFS('Graduate Preferences'!B401:ZZ401,C400),\"\")","v":""},{"$f":"IF(A400<=NGrad,IF(D400=0,0,MATCH(C400,'Graduate Preferences'!B401:ZZ401,0)),\"\")","v":""},"","","",null,null,null,""]
[398,{"$f":"IF(A401<=NGrad,'Graduate Preferences'!A402,\"\")","v":""},{"$f":"IF(A401<=NGrad,Process!A401,\"\")","v":""},{"$f":"IF(A401<=NGrad,COUNTIFS('Graduate Preferences'!B402:ZZ402,C401),\"\")","v":""},{"$f":"IF(A401<=NGrad,IF(D401=0,0,MATCH(C401,'Graduate Preferences'!B402:ZZ402,0)),\"\")","v":""},"","","",null,null,null,""]
[399,{"$f":"IF(A402<=NGrad,'Graduate Preferences'!A403,\"\")","v":""},{"$f":"IF(A402<=NGrad,Process!A402,\"\")","v":""},{"$f":"IF(A402<=NGrad,COUNTIFS('Graduate Preferences'!B403:ZZ403,C402),\"\")","v":""},{"$f":"IF(A402<=NGrad,IF(D402=0,0,MATCH(C402,'Graduate Preferences'!B403:ZZ403,0)),\"\")","v":""},"","","",null,null,null,""]
[400,{"$f":"IF(A403<=NGrad,'Graduate Preferences'!A404,\"\")","v":""},{"$f":"IF(A403<=NGrad,Process!A403,\"\")","v":""},{"$f":"IF(A403<=NGrad,COUNTIFS('Graduate Preferences'!B404:ZZ404,C403),\"\")","v":""},{"$f":"IF(A403<=NGrad,IF(D403=0,0,MATCH(C403,'Graduate Preferences'!B404:ZZ404,0)),\"\")","v":""},"","","",null,null,null,""]
[401,{"$f":"IF(A404<=NGrad,'Graduate Preferences'!A405,\"\")","v":""},{"$f":"IF(A404<=NGrad,Process!A404,\"\")","v":""},{"$f":"IF(A404<=NGrad,COUNTIFS('Graduate Preferences'!B405:ZZ405,C404),\"\")","v":""},{"$f":"IF(A404<=NGrad,IF(D404=0,0,MATCH(C404,'Graduate Preferences'!B405:ZZ405,0)),\"\")","v":""},"","","",null,null,null,""]
[402,{"$f":"IF(A405<=NGrad,'Graduate Preferences'!A406,\"\")","v":""},{"$f":"IF(A405<=NGrad,Process!A405,\"\")","v":""},{"$f":"IF(A405<=NGrad,COUNTIFS('Graduate Preferences'!B406:ZZ406,C405),\"\")","v":""},{"$f":"IF(A405<=NGrad,IF(D405=0,0,MATCH(C405,'Graduate Preferences'!B406:ZZ406,0)),\"\")","v":""},"","","",null,null,null,""]
[403,{"$f":"IF(A406<=NGrad,'Graduate Preferences'!A407,\"\")","v":""},{"$f":"IF(A406<=NGrad,Process!A406,\"\")","v":""},{"$f":"IF(A406<=NGrad,COUNTIFS('Graduate Preferences'!B407:ZZ407,C406),\"\")","v":""},{"$f":"IF(A406<=NGrad,IF(D406=0,0,MATCH(C406,'Graduate Preferences'!B407:ZZ407,0)),\"\")","v":""},"","","",null,null,null,""]
[404,{"$f":"IF(A407<=NGrad,'Graduate Preferences'!A408,\"\")","v":""},{"$f":"IF(A407<=NGrad,Process!A407,\"\")","v":""},{"$f":"IF(A407<=NGrad,COUNTIFS('Graduate Preferences'!B408:ZZ408,C407),\"\")","v":""},{"$f":"IF(A407<=NGrad,IF(D407=0,0,MATCH(C407,'Graduate Preferences'!B408:ZZ408,0)),\"\")","v":""},"","","",null,null,null,""]
[405,{"$f":"IF(A408<=NGrad,'Graduate Preferences'!A409,\"\")","v":""},{"$f":"IF(A408<=NGrad,Process!A408,\"\")","v":""},{"$f":"IF(A408<=NGrad,COUNTIFS('Graduate Preferences'!B409:ZZ409,C408),\"\")","v":""},{"$f":"IF(A408<=NGrad,IF(D408=0,0,MATCH(C408,'Graduate Preferences'!B409:ZZ409,0)),\"\")","v":""},"","","",null,null,null,""]
[406,{"$f":"IF(A409<=NGrad,'Graduate Preferences'!A410,\"\")","v":""},{"$f":"IF(A409<=NGrad,Process!A409,\"\")","v":""},{"$f":"IF(A409<=NGrad,COUNTIFS('Graduate Preferences'!B410:ZZ410,C409),\"\")","v":""},{"$f":"IF(A409<=NGrad,IF(D409=0,0,MATCH(C409,'Graduate Preferences'!B410:ZZ410,0)),\"\")","v":""},"","","",null,null,null,""]
[407,{"$f":"IF(A410<=NGrad,'Graduate Preferences'!A411,\"\")","v":""},{"$f":"IF(A410<=NGrad,Process!A410,\"\")","v":""},{"$f":"IF(A410<=NGrad,COUNTIFS('Graduate Preferences'!B411:ZZ411,C410),\"\")","v":""},{"$f":"IF(A410<=NGrad,IF(D410=0,0,MATCH(C410,'Graduate Preferences'!B411:ZZ411,0)),\"\")","v":""},"","","",null,null,null,""]
[408,{"$f":"IF(A411<=NGrad,'Graduate Preferences'!A412,\"\")","v":""},{"$f":"IF(A411<=NGrad,Process!A411,\"\")","v":""},{"$f":"IF(A411<=NGrad,COUNTIFS('Graduate Preferences'!B412:ZZ412,C411),\"\")","v":""},{"$f":"IF(A411<=NGrad,IF(D411=0,0,MATCH(C411,'Graduate Preferences'!B412:ZZ412,0)),\"\")","v":""},"","","",null,null,null,""]
[409,{"$f":"IF(A412<=NGrad,'Graduate Preferences'!A413,\"\")","v":""},{"$f":"IF(A412<=NGrad,Process!A412,\"\")","v":""},{"$f":"IF(A412<=NGrad,COUNTIFS('Graduate Preferences'!B413:ZZ413,C412),\"\")","v":""},{"$f":"IF(A412<=NGrad,IF(D412=0,0,MATCH(C412,'Graduate Preferences'!B413:ZZ413,0)),\"\")","v":""},"","","",null,null,null,""]
[410,{"$f":"IF(A413<=NGrad,'Graduate Preferences'!A414,\"\")","v":""},{"$f":"IF(A413<=NGrad,Process!A413,\"\")","v":""},{"$f":"IF(A413<=NGrad,COUNTIFS('Graduate Preferences'!B414:ZZ414,C413),\"\")","v":""},{"$f":"IF(A413<=NGrad,IF(D413=0,0,MATCH(C413,'Graduate Preferences'!B414:ZZ414,0)),\"\")","v":""},"","","",null,null,null,""]
[411,{"$f":"IF(A414<=NGrad,'Graduate Preferences'!A415,\"\")","v":""},{"$f":"IF(A414<=NGrad,Process!A414,\"\")","v":""},{"$f":"IF(A414<=NGrad,COUNTIFS('Graduate Preferences'!B415:ZZ415,C414),\"\")","v":""},{"$f":"IF(A414<=NGrad,IF(D414=0,0,MATCH(C414,'Graduate Preferences'!B415:ZZ415,0)),\"\")","v":""},"","","",null,null,null,""]
[412,{"$f":"IF(A415<=NGrad,'Graduate Preferences'!A416,\"\")","v":""},{"$f":"IF(A415<=NGrad,Process!A415,\"\")","v":""},{"$f":"IF(A415<=NGrad,COUNTIFS('Graduate Preferences'!B416:ZZ416,C415),\"\")","v":""},{"$f":"IF(A415<=NGrad,IF(D415=0,0,MATCH(C415,'Graduate Preferences'!B416:ZZ416,0)),\"\")","v":""},"","","",null,null,null,""]
[413,{"$f":"IF(A416<=NGrad,'Graduate Preferences'!A417,\"\")","v":""},{"$f":"IF(A416<=NGrad,Process!A416,\"\")","v":""},{"$f":"IF(A416<=NGrad,COUNTIFS('Graduate Preferences'!B417:ZZ417,C416),\"\")","v":""},{"$f":"IF(A416<=NGrad,IF(D416=0,0,MATCH(C416,'Graduate Preferences'!B417:ZZ417,0)),\"\")","v":""},"","","",null,null,null,""]
[414,{"$f":"IF(A417<=NGrad,'Graduate Preferences'!A418,\"\")","v":""},{"$f":"IF(A417<=NGrad,Process!A417,\"\")","v":""},{"$f":"IF(A417<=NGrad,COUNTIFS('Graduate Preferences'!B418:ZZ418,C417),\"\")","v":""},{"$f":"IF(A417<=NGrad,IF(D417=0,0,MATCH(C417,'Graduate Preferences'!B418:ZZ418,0)),\"\")","v":""},"","","",null,null,null,""]
[415,{"$f":"IF(A418<=NGrad,'Graduate Preferences'!A419,\"\")","v":""},{"$f":"IF(A418<=NGrad,Process!A418,\"\")","v":""},{"$f":"IF(A418<=NGrad,COUNTIFS('Graduate Preferences'!B419:ZZ419,C418),\"\")","v":""},{"$f":"IF(A418<=NGrad,IF(D418=0,0,MATCH(C418,'Graduate Preferences'!B419:ZZ419,0)),\"\")","v":""},"","","",null,null,null,""]
[416,{"$f":"IF(A419<=NGrad,'Graduate Preferences'!A420,\"\")","v":""},{"$f":"IF(A419<=NGrad,Process!A419,\"\")","v":""},{"$f":"IF(A419<=NGrad,COUNTIFS('Graduate Preferences'!B420:ZZ420,C419),\"\")","v":""},{"$f":"IF(A419<=NGrad,IF(D419=0,0,MATCH(C419,'Graduate Preferences'!B420:ZZ420,0)),\"\")","v":""},"","","",null,null,null,""]
[417,{"$f":"IF(A420<=NGrad,'Graduate Preferences'!A421,\"\")","v":""},{"$f":"IF(A420<=NGrad,Process!A420,\"\")","v":""},{"$f":"IF(A420<=NGrad,COUNTIFS('Graduate Preferences'!B421:ZZ421,C420),\"\")","v":""},{"$f":"IF(A420<=NGrad,IF(D420=0,0,MATCH(C420,'Graduate Preferences'!B421:ZZ421,0)),\"\")","v":""},"","","",null,null,null,""]
[418,{"$f":"IF(A421<=NGrad,'Graduate Preferences'!A422,\"\")","v":""},{"$f":"IF(A421<=NGrad,Process!A421,\"\")","v":""},{"$f":"IF(A421<=NGrad,COUNTIFS('Graduate Preferences'!B422:ZZ422,C421),\"\")","v":""},{"$f":"IF(A421<=NGrad,IF(D421=0,0,MATCH(C421,'Graduate Preferences'!B422:ZZ422,0)),\"\")","v":""},"","","",null,null,null,""]
[419,{"$f":"IF(A422<=NGrad,'Graduate Preferences'!A423,\"\")","v":""},{"$f":"IF(A422<=NGrad,Process!A422,\"\")","v":""},{"$f":"IF(A422<=NGrad,COUNTIFS('Graduate Preferences'!B423:ZZ423,C422),\"\")","v":""},{"$f":"IF(A422<=NGrad,IF(D422=0,0,MATCH(C422,'Graduate Preferences'!B423:ZZ423,0)),\"\")","v":""},"","","",null,null,null,""]
[420,{"$f":"IF(A423<=NGrad,'Graduate Preferences'!A424,\"\")","v":""},{"$f":"IF(A423<=NGrad,Process!A423,\"\")","v":""},{"$f":"IF(A423<=NGrad,COUNTIFS('Graduate Preferences'!B424:ZZ424,C423),\"\")","v":""},{"$f":"IF(A423<=NGrad,IF(D423=0,0,MATCH(C423,'Graduate Preferences'!B424:ZZ424,0)),\"\")","v":""},"","","",null,null,null,""]
[421,{"$f":"IF(A424<=NGrad,'Graduate Preferences'!A425,\"\")","v":""},{"$f":"IF(A424<=NGrad,Process!A424,\"\")","v":""},{"$f":"IF(A424<=NGrad,COUNTIFS('Graduate Preferences'!B425:ZZ425,C424),\"\")","v":""},{"$f":"IF(A424<=NGrad,IF(D424=0,0,MATCH(C424,'Graduate Preferences'!B425:ZZ425,0)),\"\")","v":""},"","","",null,null,null,""]
[422,{"$f":"IF(A425<=NGrad,'Graduate Preferences'!A426,\"\")","v":""},{"$f":"IF(A425<=NGrad,Process!A425,\"\")","v":""},{"$f":"IF(A425<=NGrad,COUNTIFS('Graduate Preferences'!B426:ZZ426,C425),\"\")","v":""},{"$f":"IF(A425<=NGrad,IF(D425=0,0,MATCH(C425,'Graduate Preferences'!B426:ZZ426,0)),\"\")","v":""},"","","",null,null,null,""]
[423,{"$f":"IF(A426<=NGrad,'Graduate Preferences'!A427,\"\")","v":""},{"$f":"IF(A426<=NGrad,Process!A426,\"\")","v":""},{"$f":"IF(A426<=NGrad,COUNTIFS('Graduate Preferences'!B427:ZZ427,C426),\"\")","v":""},{"$f":"IF(A426<=NGrad,IF(D426=0,0,MATCH(C426,'Graduate Preferences'!B427:ZZ427,0)),\"\")","v":""},"","","",null,null,null,""]
[424,{"$f":"IF(A427<=NGrad,'Graduate Preferences'!A428,\"\")","v":""},{"$f":"IF(A427<=NGrad,Process!A427,\"\")","v":""},{"$f":"IF(A427<=NGrad,COUNTIFS('Graduate Preferences'!B428:ZZ428,C427),\"\")","v":""},{"$f":"IF(A427<=NGrad,IF(D427=0,0,MATCH(C427,'Graduate Preferences'!B428:ZZ428,0)),\"\")","v":""},"","","",null,null,null,""]
[425,{"$f":"IF(A428<=NGrad,'Graduate Preferences'!A429,\"\")","v":""},{"$f":"IF(A428<=NGrad,Process!A428,\"\")","v":""},{"$f":"IF(A428<=NGrad,COUNTIFS('Graduate Preferences'!B429:ZZ429,C428),\"\")","v":""},{"$f":"IF(A428<=NGrad,IF(D428=0,0,MATCH(C428,'Graduate Preferences'!B429:ZZ429,0)),\"\")","v":""},"","","",null,null,null,""]
[426,{"$f":"IF(A429<=NGrad,'Graduate Preferences'!A430,\"\")","v":""},{"$f":"IF(A429<=NGrad,Process!A429,\"\")","v":""},{"$f":"IF(A429<=NGrad,COUNTIFS('Graduate Preferences'!B430:ZZ430,C429),\"\")","v":""},{"$f":"IF(A429<=NGrad,IF(D429=0,0,MATCH(C429,'Graduate Preferences'!B430:ZZ430,0)),\"\")","v":""},"","","",null,null,null,""]
[427,{"$f":"IF(A430<=NGrad,'Graduate Preferences'!A431,\"\")","v":""},{"$f":"IF(A430<=NGrad,Process!A430,\"\")","v":""},{"$f":"IF(A430<=NGrad,COUNTIFS('Graduate Preferences'!B431:ZZ431,C430),\"\")","v":""},{"$f":"IF(A430<=NGrad,IF(D430=0,0,MATCH(C430,'Graduate Preferences'!B431:ZZ431,0)),\"\")","v":""},"","","",null,null,null,""]
[428,{"$f":"IF(A431<=NGrad,'Graduate Preferences'!A432,\"\")","v":""},{"$f":"IF(A431<=NGrad,Process!A431,\"\")","v":""},{"$f":"IF(A431<=NGrad,COUNTIFS('Graduate Preferences'!B432:ZZ432,C431),\"\")","v":""},{"$f":"IF(A431<=NGrad,IF(D431=0,0,MATCH(C431,'Graduate Preferences'!B432:ZZ432,0)),\"\")","v":""},"","","",null,null,null,""]
[429,{"$f":"IF(A432<=NGrad,'Graduate Preferences'!A433,\"\")","v":""},{"$f":"IF(A432<=NGrad,Process!A432,\"\")","v":""},{"$f":"IF(A432<=NGrad,COUNTIFS('Graduate Preferences'!B433:ZZ433,C432),\"\")","v":""},{"$f":"IF(A432<=NGrad,IF(D432=0,0,MATCH(C432,'Graduate Preferences'!B433:ZZ433,0)),\"\")","v":""},"","","",null,null,null,""]
[430,{"$f":"IF(A433<=NGrad,'Graduate Preferences'!A434,\"\")","v":""},{"$f":"IF(A433<=NGrad,Process!A433,\"\")","v":""},{"$f":"IF(A433<=NGrad,COUNTIFS('Graduate Preferences'!B434:ZZ434,C433),\"\")","v":""},{"$f":"IF(A433<=NGrad,IF(D433=0,0,MATCH(C433,'Graduate Preferences'!B434:ZZ434,0)),\"\")","v":""},"","","",null,null,null,""]
[431,{"$f":"IF(A434<=NGrad,'Graduate Preferences'!A435,\"\")","v":""},{"$f":"IF(A434<=NGrad,Process!A434,\"\")","v":""},{"$f":"IF(A434<=NGrad,COUNTIFS('Graduate Preferences'!B435:ZZ435,C434),\"\")","v":""},{"$f":"IF(A434<=NGrad,IF(D434=0,0,MATCH(C434,'Graduate Preferences'!B435:ZZ435,0)),\"\")","v":""},"","","",null,null,null,""]
[432,{"$f":"IF(A435<=NGrad,'Graduate Preferences'!A436,\"\")","v":""},{"$f":"IF(A435<=NGrad,Process!A435,\"\")","v":""},{"$f":"IF(A435<=NGrad,COUNTIFS('Graduate Preferences'!B436:ZZ436,C435),\"\")","v":""},{"$f":"IF(A435<=NGrad,IF(D435=0,0,MATCH(C435,'Graduate Preferences'!B436:ZZ436,0)),\"\")","v":""},"","","",null,null,null,""]
[433,{"$f":"IF(A436<=NGrad,'Graduate Preferences'!A437,\"\")","v":""},{"$f":"IF(A436<=NGrad,Process!A436,\"\")","v":""},{"$f":"IF(A436<=NGrad,COUNTIFS('Graduate Preferences'!B437:ZZ437,C436),\"\")","v":""},{"$f":"IF(A436<=NGrad,IF(D436=0,0,MATCH(C436,'Graduate Preferences'!B437:ZZ437,0)),\"\")","v":""},"","","",null,null,null,""]
[434,{"$f":"IF(A437<=NGrad,'Graduate Preferences'!A438,\"\")","v":""},{"$f":"IF(A437<=NGrad,Process!A437,\"\")","v":""},{"$f":"IF(A437<=NGrad,COUNTIFS('Graduate Preferences'!B438:ZZ438,C437),\"\")","v":""},{"$f":"IF(A437<=NGrad,IF(D437=0,0,MATCH(C437,'Graduate Preferences'!B438:ZZ438,0)),\"\")","v":""},"","","",null,null,null,""]
[435,{"$f":"IF(A438<=NGrad,'Graduate Preferences'!A439,\"\")","v":""},{"$f":"IF(A438<=NGrad,Process!A438,\"\")","v":""},{"$f":"IF(A438<=NGrad,COUNTIFS('Graduate Preferences'!B439:ZZ439,C438),\"\")","v":""},{"$f":"IF(A438<=NGrad,IF(D438=0,0,MATCH(C438,'Graduate Preferences'!B439:ZZ439,0)),\"\")","v":""},"","","",null,null,null,""]
[436,{"$f":"IF(A439<=NGrad,'Graduate Preferences'!A440,\"\")","v":""},{"$f":"IF(A439<=NGrad,Process!A439,\"\")","v":""},{"$f":"IF(A439<=NGrad,COUNTIFS('Graduate Preferences'!B440:ZZ440,C439),\"\")","v":""},{"$f":"IF(A439<=NGrad,IF(D439=0,0,MATCH(C439,'Graduate Preferences'!B440:ZZ440,0)),\"\")","v":""},"","","",null,null,null,""]
[437,{"$f":"IF(A440<=NGrad,'Graduate Preferences'!A441,\"\")","v":""},{"$f":"IF(A440<=NGrad,Process!A440,\"\")","v":""},{"$f":"IF(A440<=NGrad,COUNTIFS('Graduate Preferences'!B441:ZZ441,C440),\"\")","v":""},{"$f":"IF(A440<=NGrad,IF(D440=0,0,MATCH(C440,'Graduate Preferences'!B441:ZZ441,0)),\"\")","v":""},"","","",null,null,null,""]
[438,{"$f":"IF(A441<=NGrad,'Graduate Preferences'!A442,\"\")","v":""},{"$f":"IF(A441<=NGrad,Process!A441,\"\")","v":""},{"$f":"IF(A441<=NGrad,COUNTIFS('Graduate Preferences'!B442:ZZ442,C441),\"\")","v":""},{"$f":"IF(A441<=NGrad,IF(D441=0,0,MATCH(C441,'Graduate Preferences'!B442:ZZ442,0)),\"\")","v":""},"","","",null,null,null,""]
[439,{"$f":"IF(A442<=NGrad,'Graduate Preferences'!A443,\"\")","v":""},{"$f":"IF(A442<=NGrad,Process!A442,\"\")","v":""},{"$f":"IF(A442<=NGrad,COUNTIFS('Graduate Preferences'!B443:ZZ443,C442),\"\")","v":""},{"$f":"IF(A442<=NGrad,IF(D442=0,0,MATCH(C442,'Graduate Preferences'!B443:ZZ443,0)),\"\")","v":""},"","","",null,null,null,""]
[440,{"$f":"IF(A443<=NGrad,'Graduate Preferences'!A444,\"\")","v":""},{"$f":"IF(A443<=NGrad,Process!A443,\"\")","v":""},{"$f":"IF(A443<=NGrad,COUNTIFS('Graduate Preferences'!B444:ZZ444,C443),\"\")","v":""},{"$f":"IF(A443<=NGrad,IF(D443=0,0,MATCH(C443,'Graduate Preferences'!B444:ZZ444,0)),\"\")","v":""},"","","",null,null,null,""]
[441,{"$f":"IF(A444<=NGrad,'Graduate Preferences'!A445,\"\")","v":""},{"$f":"IF(A444<=NGrad,Process!A444,\"\")","v":""},{"$f":"IF(A444<=NGrad,COUNTIFS('Graduate Preferences'!B445:ZZ445,C444),\"\")","v":""},{"$f":"IF(A444<=NGrad,IF(D444=0,0,MATCH(C444,'Graduate Preferences'!B445:ZZ445,0)),\"\")","v":""},"","","",null,null,null,""]
[442,{"$f":"IF(A445<=NGrad,'Graduate Preferences'!A446,\"\")","v":""},{"$f":"IF(A445<=NGrad,Process!A445,\"\")","v":""},{"$f":"IF(A445<=NGrad,COUNTIFS('Graduate Preferences'!B446:ZZ446,C445),\"\")","v":""},{"$f":"IF(A445<=NGrad,IF(D445=0,0,MATCH(C445,'Graduate Preferences'!B446:ZZ446,0)),\"\")","v":""},"","","",null,null,null,""]
[443,{"$f":"IF(A446<=NGrad,'Graduate Preferences'!A447,\"\")","v":""},{"$f":"IF(A446<=NGrad,Process!A446,\"\")","v":""},{"$f":"IF(A446<=NGrad,COUNTIFS('Graduate Preferences'!B447:ZZ447,C446),\"\")","v":""},{"$f":"IF(A446<=NGrad,IF(D446=0,0,MATCH(C446,'Graduate Preferences'!B447:ZZ447,0)),\"\")","v":""},"","","",null,null,null,""]
[444,{"$f":"IF(A447<=NGrad,'Graduate Preferences'!A448,\"\")","v":""},{"$f":"IF(A447<=NGrad,Process!A447,\"\")","v":""},{"$f":"IF(A447<=NGrad,COUNTIFS('Graduate Preferences'!B448:ZZ448,C447),\"\")","v":""},{"$f":"IF(A447<=NGrad,IF(D447=0,0,MATCH(C447,'Graduate Preferences'!B448:ZZ448,0)),\"\")","v":""},"","","",null,null,null,""]
[445,{"$f":"IF(A448<=NGrad,'Graduate Preferences'!A449,\"\")","v":""},{"$f":"IF(A448<=NGrad,Process!A448,\"\")","v":""},{"$f":"IF(A448<=NGrad,COUNTIFS('Graduate Preferences'!B449:ZZ449,C448),\"\")","v":""},{"$f":"IF(A448<=NGrad,IF(D448=0,0,MATCH(C448,'Graduate Preferences'!B449:ZZ449,0)),\"\")","v":""},"","","",null,null,null,""]
[446,{"$f":"IF(A449<=NGrad,'Graduate Preferences'!A450,\"\")","v":""},{"$f":"IF(A449<=NGrad,Process!A449,\"\")","v":""},{"$f":"IF(A449<=NGrad,COUNTIFS('Graduate Preferences'!B450:ZZ450,C449),\"\")","v":""},{"$f":"IF(A449<=NGrad,IF(D449=0,0,MATCH(C449,'Graduate Preferences'!B450:ZZ450,0)),\"\")","v":""},"","","",null,null,null,""]
[447,{"$f":"IF(A450<=NGrad,'Graduate Preferences'!A451,\"\")","v":""},{"$f":"IF(A450<=NGrad,Process!A450,\"\")","v":""},{"$f":"IF(A450<=NGrad,COUNTIFS('Graduate Preferences'!B451:ZZ451,C450),\"\")","v":""},{"$f":"IF(A450<=NGrad,IF(D450=0,0,MATCH(C450,'Graduate Preferences'!B451:ZZ451,0)),\"\")","v":""},"","","",null,null,null,""]
[448,{"$f":"IF(A451<=NGrad,'Graduate Preferences'!A452,\"\")","v":""},{"$f":"IF(A451<=NGrad,Process!A451,\"\")","v":""},{"$f":"IF(A451<=NGrad,COUNTIFS('Graduate Preferences'!B452:ZZ452,C451),\"\")","v":""},{"$f":"IF(A451<=NGrad,IF(D451=0,0,MATCH(C451,'Graduate Preferences'!B452:ZZ452,0)),\"\")","v":""},"","","",null,null,null,""]
[449,{"$f":"IF(A452<=NGrad,'Graduate Preferences'!A453,\"\")","v":""},{"$f":"IF(A452<=NGrad,Process!A452,\"\")","v":""},{"$f":"IF(A452<=NGrad,COUNTIFS('Graduate Preferences'!B453:ZZ453,C452),\"\")","v":""},{"$f":"IF(A452<=NGrad,IF(D452=0,0,MATCH(C452,'Graduate Preferences'!B453:ZZ453,0)),\"\")","v":""},"","","",null,null,null,""]
[450,{"$f":"IF(A453<=NGrad,'Graduate Preferences'!A454,\"\")","v":""},{"$f":"IF(A453<=NGrad,Process!A453,\"\")","v":""},{"$f":"IF(A453<=NGrad,COUNTIFS('Graduate Preferences'!B454:ZZ454,C453),\"\")","v":""},{"$f":"IF(A453<=NGrad,IF(D453=0,0,MATCH(C453,'Graduate Preferences'!B454:ZZ454,0)),\"\")","v":""},"",{"$f":"IF(F453=\"\",\"\",RANK(F453,F$4:F$1000))","v":""},"",null,null,null,{"$f":"IF(MAX(H$4:H$1000)>=A453,MATCH(A453,H$4:H$1000,0),\"\")","v":""}]
[451,{"$f":"IF(A454<=NGrad,'Graduate Preferences'!A455,\"\")","v":""},{"$f":"IF(A454<=NGrad,Process!A454,\"\")","v":""},{"$f":"IF(A454<=NGrad,COUNTIFS('Graduate Preferences'!B455:ZZ455,C454),\"\")","v":""},{"$f":"IF(A454<=NGrad,IF(D454=0,0,MATCH(C454,'Graduate Preferences'!B455:ZZ455,0)),\"\")","v":""},{"$f":"IF(AND(J454<>\"-\",J454>0,I454=F$2),J454,\"\")","v":""},"",{"$f":"IF(F454=\"\",\"\",MAX(G$4:G$1000)-G454+1)","v":""},null,null,null,""]
[452,{"$f":"IF(A455<=NGrad,'Graduate Preferences'!A456,\"\")","v":""},{"$f":"IF(A455<=NGrad,Process!A455,\"\")","v":""},{"$f":"IF(A455<=NGrad,COUNTIFS('Graduate Preferences'!B456:ZZ456,C455),\"\")","v":""},{"$f":"IF(A455<=NGrad,IF(D455=0,0,MATCH(C455,'Graduate Preferences'!B456:ZZ456,0)),\"\")","v":""},"","","",null,null,null,""]
[453,{"$f":"IF(A456<=NGrad,'Graduate Preferences'!A457,\"\")","v":""},{"$f":"IF(A456<=NGrad,Process!A456,\"\")","v":""},{"$f":"IF(A456<=NGrad,COUNTIFS('Graduate Preferences'!B457:ZZ457,C456),\"\")","v":""},{"$f":"IF(A456<=NGrad,IF(D456=0,0,MATCH(C456,'Graduate Preferences'!B457:ZZ457,0)),\"\")","v":""},"","","",null,null,null,""]
[454,{"$f":"IF(A457<=NGrad,'Graduate Preferences'!A458,\"\")","v":""},{"$f":"IF(A457<=NGrad,Process!A457,\"\")","v":""},{"$f":"IF(A457<=NGrad,COUNTIFS('Graduate Preferences'!B458:ZZ458,C457),\"\")","v":""},{"$f":"IF(A457<=NGrad,IF(D457=0,0,MATCH(C457,'Graduate Preferences'!B458:ZZ458,0)),\"\")","v":""},"","","",null,null,null,""]
[455,{"$f":"IF(A458<=NGrad,'Graduate Preferences'!A459,\"\")","v":""},{"$f":"IF(A458<=NGrad,Process!A458,\"\")","v":""},{"$f":"IF(A458<=NGrad,COUNTIFS('Graduate Preferences'!B459:ZZ459,C458),\"\")","v":""},{"$f":"IF(A458<=NGrad,IF(D458=0,0,MATCH(C458,'Graduate Preferences'!B459:ZZ459,0)),\"\")","v":""},"","","",null,null,null,""]
[456,{"$f":"IF(A459<=NGrad,'Graduate Preferences'!A460,\"\")","v":""},{"$f":"IF(A459<=NGrad,Process!A459,\"\")","v":""},{"$f":"IF(A459<=NGrad,COUNTIFS('Graduate Preferences'!B460:ZZ460,C459),\"\")","v":""},{"$f":"IF(A459<=NGrad,IF(D459=0,0,MATCH(C459,'Graduate Preferences'!B460:ZZ460,0)),\"\")","v":""},"","","",null,null,null,""]
[457,{"$f":"IF(A460<=NGrad,'Graduate Preferences'!A461,\"\")","v":""},{"$f":"IF(A460<=NGrad,Process!A460,\"\")","v":""},{"$f":"IF(A460<=NGrad,COUNTIFS('Graduate Preferences'!B461:ZZ461,C460),\"\")","v":""},{"$f":"IF(A460<=NGrad,IF(D460=0,0,MATCH(C460,'Graduate Preferences'!B461:ZZ461,0)),\"\")","v":""},"","","",null,null,null,""]
[458,{"$f":"IF(A461<=NGrad,'Graduate Preferences'!A462,\"\")","v":""},{"$f":"IF(A461<=NGrad,Process!A461,\"\")","v":""},{"$f":"IF(A461<=NGrad,COUNTIFS('Graduate Preferences'!B462:ZZ462,C461),\"\")","v":""},{"$f":"IF(A461<=NGrad,IF(D461=0,0,MATCH(C461,'Graduate Preferences'!B462:ZZ462,0)),\"\")","v":""},"","","",null,null,null,""]
[459,{"$f":"IF(A462<=NGrad,'Graduate Preferences'!A463,\"\")","v":""},{"$f":"IF(A462<=NGrad,Process!A462,\"\")","v":""},{"$f":"IF(A462<=NGrad,COUNTIFS('Graduate Preferences'!B463:ZZ463,C462),\"\")","v":""},{"$f":"IF(A462<=NGrad,IF(D462=0,0,MATCH(C462,'Graduate Preferences'!B463:ZZ463,0)),\"\")","v":""},"","","",null,null,null,""]
[460,{"$f":"IF(A463<=NGrad,'Graduate Preferences'!A464,\"\")","v":""},{"$f":"IF(A463<=NGrad,Process!A463,\"\")","v":""},{"$f":"IF(A463<=NGrad,COUNTIFS('Graduate Preferences'!B464:ZZ464,C463),\"\")","v":""},{"$f":"IF(A463<=NGrad,IF(D463=0,0,MATCH(C463,'Graduate Preferences'!B464:ZZ464,0)),\"\")","v":""},"","","",null,null,null,""]
[461,{"$f":"IF(A464<=NGrad,'Graduate Preferences'!A465,\"\")","v":""},{"$f":"IF(A464<=NGrad,Process!A464,\"\")","v":""},{"$f":"IF(A464<=NGrad,COUNTIFS('Graduate Preferences'!B465:ZZ465,C464),\"\")","v":""},{"$f":"IF(A464<=NGrad,IF(D464=0,0,MATCH(C464,'Graduate Preferences'!B465:ZZ465,0)),\"\")","v":""},"","","",null,null,null,""]
[462,{"$f":"IF(A465<=NGrad,'Graduate Preferences'!A466,\"\")","v":""},{"$f":"IF(A465<=NGrad,Process!A465,\"\")","v":""},{"$f":"IF(A465<=NGrad,COUNTIFS('Graduate Preferences'!B466:ZZ466,C465),\"\")","v":""},{"$f":"IF(A465<=NGrad,IF(D465=0,0,MATCH(C465,'Graduate Preferences'!B466:ZZ466,0)),\"\")","v":""},"","","",null,null,null,""]
[463,{"$f":"IF(A466<=NGrad,'Graduate Preferences'!A467,\"\")","v":""},{"$f":"IF(A466<=NGrad,Process!A466,\"\")","v":""},{"$f":"IF(A466<=NGrad,COUNTIFS('Graduate Preferences'!B467:ZZ467,C466),\"\")","v":""},{"$f":"IF(A466<=NGrad,IF(D466=0,0,MATCH(C466,'Graduate Preferences'!B467:ZZ467,0)),\"\")","v":""},"","","",null,null,null,""]
[464,{"$f":"IF(A467<=NGrad,'Graduate Preferences'!A468,\"\")","v":""},{"$f":"IF(A467<=NGrad,Process!A467,\"\")","v":""},{"$f":"IF(A467<=NGrad,COUNTIFS('Graduate Preferences'!B468:ZZ468,C467),\"\")","v":""},{"$f":"IF(A467<=NGrad,IF(D467=0,0,MATCH(C467,'Graduate Preferences'!B468:ZZ468,0)),\"\")","v":""},"","","",null,null,null,""]
[465,{"$f":"IF(A468<=NGrad,'Graduate Preferences'!A469,\"\")","v":""},{"$f":"IF(A468<=NGrad,Process!A468,\"\")","v":""},{"$f":"IF(A468<=NGrad,COUNTIFS('Graduate Preferences'!B469:ZZ469,C468),\"\")","v":""},{"$f":"IF(A468<=NGrad,IF(D468=0,0,MATCH(C468,'Graduate Preferences'!B469:ZZ469,0)),\"\")","v":""},"","","",null,null,null,""]
[466,{"$f":"IF(A469<=NGrad,'Graduate Preferences'!A470,\"\")","v":""},{"$f":"IF(A469<=NGrad,Process!A469,\"\")","v":""},{"$f":"IF(A469<=NGrad,COUNTIFS('Graduate Preferences'!B470:ZZ470,C469),\"\")","v":""},{"$f":"IF(A469<=NGrad,IF(D469=0,0,MATCH(C469,'Graduate Preferences'!B470:ZZ470,0)),\"\")","v":""},"","","",null,null,null,""]
[467,{"$f":"IF(A470<=NGrad,'Graduate Preferences'!A471,\"\")","v":""},{"$f":"IF(A470<=NGrad,Process!A470,\"\")","v":""},{"$f":"IF(A470<=NGrad,COUNTIFS('Graduate Preferences'!B471:ZZ471,C470),\"\")","v":""},{"$f":"IF(A470<=NGrad,IF(D470=0,0,MATCH(C470,'Graduate Preferences'!B471:ZZ471,0)),\"\")","v":""},"","","",null,null,null,""]
[468,{"$f":"IF(A471<=NGrad,'Graduate Preferences'!A472,\"\")","v":""},{"$f":"IF(A471<=NGrad,Process!A471,\"\")","v":""},{"$f":"IF(A471<=NGrad,COUNTIFS('Graduate Preferences'!B472:ZZ472,C471),\"\")","v":""},{"$f":"IF(A471<=NGrad,IF(D471=0,0,MATCH(C471,'Graduate Preferences'!B472:ZZ472,0)),\"\")","v":""},"","","",null,null,null,""]
[469,{"$f":"IF(A472<=NGrad,'Graduate Preferences'!A473,\"\")","v":""},{"$f":"IF(A472<=NGrad,Process!A472,\"\")","v":""},{"$f":"IF(A472<=NGrad,COUNTIFS('Graduate Preferences'!B473:ZZ473,C472),\"\")","v":""},{"$f":"IF(A472<=NGrad,IF(D472=0,0,MATCH(C472,'Graduate Preferences'!B473:ZZ473,0)),\"\")","v":""},"","","",null,null,null,""]
[470,{"$f":"IF(A473<=NGrad,'Graduate Preferences'!A474,\"\")","v":""},{"$f":"IF(A473<=NGrad,Process!A473,\"\")","v":""},{"$f":"IF(A473<=NGrad,COUNTIFS('Graduate Preferences'!B474:ZZ474,C473),\"\")","v":""},{"$f":"IF(A473<=NGrad,IF(D473=0,0,MATCH(C473,'Graduate Preferences'!B474:ZZ474,0)),\"\")","v":""},"","","",null,null,null,""]
[471,{"$f":"IF(A474<=NGrad,'Graduate Preferences'!A475,\"\")","v":""},{"$f":"IF(A474<=NGrad,Process!A474,\"\")","v":""},{"$f":"IF(A474<=NGrad,COUNTIFS('Graduate Preferences'!B475:ZZ475,C474),\"\")","v":""},{"$f":"IF(A474<=NGrad,IF(D474=0,0,MATCH(C474,'Graduate Preferences'!B475:ZZ475,0)),\"\")","v":""},"","","",null,null,null,""]
[472,{"$f":"IF(A475<=NGrad,'Graduate Preferences'!A476,\"\")","v":""},{"$f":"IF(A475<=NGrad,Process!A475,\"\")","v":""},{"$f":"IF(A475<=NGrad,COUNTIFS('Graduate Preferences'!B476:ZZ476,C475),\"\")","v":""},{"$f":"IF(A475<=NGrad,IF(D475=0,0,MATCH(C475,'Graduate Preferences'!B476:ZZ476,0)),\"\")","v":""},"","","",null,null,null,""]
[473,{"$f":"IF(A476<=NGrad,'Graduate Preferences'!A477,\"\")","v":""},{"$f":"IF(A476<=NGrad,Process!A476,\"\")","v":""},{"$f":"IF(A476<=NGrad,COUNTIFS('Graduate Preferences'!B477:ZZ477,C476),\"\")","v":""},{"$f":"IF(A476<=NGrad,IF(D476=0,0,MATCH(C476,'Graduate Preferences'!B477:ZZ477,0)),\"\")","v":""},"","","",null,null,null,""]
[474,{"$f":"IF(A477<=NGrad,'Graduate Preferences'!A478,\"\")","v":""},{"$f":"IF(A477<=NGrad,Process!A477,\"\")","v":""},{"$f":"IF(A477<=NGrad,COUNTIFS('Graduate Preferences'!B478:ZZ478,C477),\"\")","v":""},{"$f":"IF(A477<=NGrad,IF(D477=0,0,MATCH(C477,'Graduate Preferences'!B478:ZZ478,0)),\"\")","v":""},"","","",null,null,null,""]
[475,{"$f":"IF(A478<=NGrad,'Graduate Preferences'!A479,\"\")","v":""},{"$f":"IF(A478<=NGrad,Process!A478,\"\")","v":""},{"$f":"IF(A478<=NGrad,COUNTIFS('Graduate Preferences'!B479:ZZ479,C478),\"\")","v":""},{"$f":"IF(A478<=NGrad,IF(D478=0,0,MATCH(C478,'Graduate Preferences'!B479:ZZ479,0)),\"\")","v":""},"","","",null,null,null,""]
[476,{"$f":"IF(A479<=NGrad,'Graduate Preferences'!A480,\"\")","v":""},{"$f":"IF(A479<=NGrad,Process!A479,\"\")","v":""},{"$f":"IF(A479<=NGrad,COUNTIFS('Graduate Preferences'!B480:ZZ480,C479),\"\")","v":""},{"$f":"IF(A479<=NGrad,IF(D479=0,0,MATCH(C479,'Graduate Preferences'!B480:ZZ480,0)),\"\")","v":""},"","","",null,null,null,""]
[477,{"$f":"IF(A480<=NGrad,'Graduate Preferences'!A481,\"\")","v":""},{"$f":"IF(A480<=NGrad,Process!A480,\"\")","v":""},{"$f":"IF(A480<=NGrad,COUNTIFS('Graduate Preferences'!B481:ZZ481,C480),\"\")","v":""},{"$f":"IF(A480<=NGrad,IF(D480=0,0,MATCH(C480,'Graduate Preferences'!B481:ZZ481,0)),\"\")","v":""},"","","",null,null,null,""]
[478,{"$f":"IF(A481<=NGrad,'Graduate Preferences'!A482,\"\")","v":""},{"$f":"IF(A481<=NGrad,Process!A481,\"\")","v":""},{"$f":"IF(A481<=NGrad,COUNTIFS('Graduate Preferences'!B482:ZZ482,C481),\"\")","v":""},{"$f":"IF(A481<=NGrad,IF(D481=0,0,MATCH(C481,'Graduate Preferences'!B482:ZZ482,0)),\"\")","v":""},"","","",null,null,null,""]
[479,{"$f":"IF(A482<=NGrad,'Graduate Preferences'!A483,\"\")","v":""},{"$f":"IF(A482<=NGrad,Process!A482,\"\")","v":""},{"$f":"IF(A482<=NGrad,COUNTIFS('Graduate Preferences'!B483:ZZ483,C482),\"\")","v":""},{"$f":"IF(A482<=NGrad,IF(D482=0,0,MATCH(C482,'Graduate Preferences'!B483:ZZ483,0)),\"\")","v":""},"","","",null,null,null,""]
[480,{"$f":"IF(A483<=NGrad,'Graduate Preferences'!A484,\"\")","v":""},{"$f":"IF(A483<=NGrad,Process!A483,\"\")","v":""},{"$f":"IF(A483<=NGrad,COUNTIFS('Graduate Preferences'!B484:ZZ484,C483),\"\")","v":""},{"$f":"IF(A483<=NGrad,IF(D483=0,0,MATCH(C483,'Graduate Preferences'!B484:ZZ484,0)),\"\")","v":""},"","","",null,null,null,""]
[481,{"$f":"IF(A484<=NGrad,'Graduate Preferences'!A485,\"\")","v":""},{"$f":"IF(A484<=NGrad,Process!A484,\"\")","v":""},{"$f":"IF(A484<=NGrad,COUNTIFS('Graduate Preferences'!B485:ZZ485,C484),\"\")","v":""},{"$f":"IF(A484<=NGrad,IF(D484=0,0,MATCH(C484,'Graduate Preferences'!B485:ZZ485,0)),\"\")","v":""},"","","",null,null,null,""]
[482,{"$f":"IF(A485<=NGrad,'Graduate Preferences'!A486,\"\")","v":""},{"$f":"IF(A485<=NGrad,Process!A485,\"\")","v":""},{"$f":"IF(A485<=NGrad,COUNTIFS('Graduate Preferences'!B486:ZZ486,C485),\"\")","v":""},{"$f":"IF(A485<=NGrad,IF(D485=0,0,MATCH(C485,'Graduate Preferences'!B486:ZZ486,0)),\"\")","v":""},"","","",null,null,null,""]
[483,{"$f":"IF(A486<=NGrad,'Graduate Preferences'!A487,\"\")","v":""},{"$f":"IF(A486<=NGrad,Process!A486,\"\")","v":""},{"$f":"IF(A486<=NGrad,COUNTIFS('Graduate Preferences'!B487:ZZ487,C486),\"\")","v":""},{"$f":"IF(A486<=NGrad,IF(D486=0,0,MATCH(C486,'Graduate Preferences'!B487:ZZ487,0)),\"\")","v":""},"","","",null,null,null,""]
[484,{"$f":"IF(A487<=NGrad,'Graduate Preferences'!A488,\"\")","v":""},{"$f":"IF(A487<=NGrad,Process!A487,\"\")","v":""},{"$f":"IF(A487<=NGrad,COUNTIFS('Graduate Preferences'!B488:ZZ488,C487),\"\")","v":""},{"$f":"IF(A487<=NGrad,IF(D487=0,0,MATCH(C487,'Graduate Preferences'!B488:ZZ488,0)),\"\")","v":""},"","","",null,null,null,""]
[485,{"$f":"IF(A488<=NGrad,'Graduate Preferences'!A489,\"\")","v":""},{"$f":"IF(A488<=NGrad,Process!A488,\"\")","v":""},{"$f":"IF(A488<=NGrad,COUNTIFS('Graduate Preferences'!B489:ZZ489,C488),\"\")","v":""},{"$f":"IF(A488<=NGrad,IF(D488=0,0,MATCH(C488,'Graduate Preferences'!B489:ZZ489,0)),\"\")","v":""},"","","",null,null,null,""]
[486,{"$f":"IF(A489<=NGrad,'Graduate Preferences'!A490,\"\")","v":""},{"$f":"IF(A489<=NGrad,Process!A489,\"\")","v":""},{"$f":"IF(A489<=NGrad,COUNTIFS('Graduate Preferences'!B490:ZZ490,C489),\"\")","v":""},{"$f":"IF(A489<=NGrad,IF(D489=0,0,MATCH(C489,'Graduate Preferences'!B490:ZZ490,0)),\"\")","v":""},"","","",null,null,null,""]
[487,{"$f":"IF(A490<=NGrad,'Graduate Preferences'!A491,\"\")","v":""},{"$f":"IF(A490<=NGrad,Process!A490,\"\")","v":""},{"$f":"IF(A490<=NGrad,COUNTIFS('Graduate Preferences'!B491:ZZ491,C490),\"\")","v":""},{"$f":"IF(A490<=NGrad,IF(D490=0,0,MATCH(C490,'Graduate Preferences'!B491:ZZ491,0)),\"\")","v":""},"","","",null,null,null,""]
[488,{"$f":"IF(A491<=NGrad,'Graduate Preferences'!A492,\"\")","v":""},{"$f":"IF(A491<=NGrad,Process!A491,\"\")","v":""},{"$f":"IF(A491<=NGrad,COUNTIFS('Graduate Preferences'!B492:ZZ492,C491),\"\")","v":""},{"$f":"IF(A491<=NGrad,IF(D491=0,0,MATCH(C491,'Graduate Preferences'!B492:ZZ492,0)),\"\")","v":""},"","","",null,null,null,""]
[489,{"$f":"IF(A492<=NGrad,'Graduate Preferences'!A493,\"\")","v":""},{"$f":"IF(A492<=NGrad,Process!A492,\"\")","v":""},{"$f":"IF(A492<=NGrad,COUNTIFS('Graduate Preferences'!B493:ZZ493,C492),\"\")","v":""},{"$f":"IF(A492<=NGrad,IF(D492=0,0,MATCH(C492,'Graduate Preferences'!B493:ZZ493,0)),\"\")","v":""},"","","",null,null,null,""]
[490,{"$f":"IF(A493<=NGrad,'Graduate Preferences'!A494,\"\")","v":""},{"$f":"IF(A493<=NGrad,Process!A493,\"\")","v":""},{"$f":"IF(A493<=NGrad,COUNTIFS('Graduate Preferences'!B494:ZZ494,C493),\"\")","v":""},{"$f":"IF(A493<=NGrad,IF(D493=0,0,MATCH(C493,'Graduate Preferences'!B494:ZZ494,0)),\"\")","v":""},"","","",null,null,null,""]
[491,{"$f":"IF(A494<=NGrad,'Graduate Preferences'!A495,\"\")","v":""},{"$f":"IF(A494<=NGrad,Process!A494,\"\")","v":""},{"$f":"IF(A494<=NGrad,COUNTIFS('Graduate Preferences'!B495:ZZ495,C494),\"\")","v":""},{"$f":"IF(A494<=NGrad,IF(D494=0,0,MATCH(C494,'Graduate Preferences'!B495:ZZ495,0)),\"\")","v":""},"","","",null,null,null,""]
[492,{"$f":"IF(A495<=NGrad,'Graduate Preferences'!A496,\"\")","v":""},{"$f":"IF(A495<=NGrad,Process!A495,\"\")","v":""},{"$f":"IF(A495<=NGrad,COUNTIFS('Graduate Preferences'!B496:ZZ496,C495),\"\")","v":""},{"$f":"IF(A495<=NGrad,IF(D495=0,0,MATCH(C495,'Graduate Preferences'!B496:ZZ496,0)),\"\")","v":""},"","","",null,null,null,""]
[493,{"$f":"IF(A496<=NGrad,'Graduate Preferences'!A497,\"\")","v":""},{"$f":"IF(A496<=NGrad,Process!A496,\"\")","v":""},{"$f":"IF(A496<=NGrad,COUNTIFS('Graduate Preferences'!B497:ZZ497,C496),\"\")","v":""},{"$f":"IF(A496<=NGrad,IF(D496=0,0,MATCH(C496,'Graduate Preferences'!B497:ZZ497,0)),\"\")","v":""},"","","",null,null,null,""]
[494,{"$f":"IF(A497<=NGrad,'Graduate Preferences'!A498,\"\")","v":""},{"$f":"IF(A497<=NGrad,Process!A497,\"\")","v":""},{"$f":"IF(A497<=NGrad,COUNTIFS('Graduate Preferences'!B498:ZZ498,C497),\"\")","v":""},{"$f":"IF(A497<=NGrad,IF(D497=0,0,MATCH(C497,'Graduate Preferences'!B498:ZZ498,0)),\"\")","v":""},"","","",null,null,null,""]
[495,{"$f":"IF(A498<=NGrad,'Graduate Preferences'!A499,\"\")","v":""},{"$f":"IF(A498<=NGrad,Process!A498,\"\")","v":""},{"$f":"IF(A498<=NGrad,COUNTIFS('Graduate Preferences'!B499:ZZ499,C498),\"\")","v":""},{"$f":"IF(A498<=NGrad,IF(D498=0,0,MATCH(C498,'Graduate Preferences'!B499:ZZ499,0)),\"\")","v":""},"","","",null,null,null,""]
[496,{"$f":"IF(A499<=NGrad,'Graduate Preferences'!A500,\"\")","v":""},{"$f":"IF(A499<=NGrad,Process!A499,\"\")","v":""},{"$f":"IF(A499<=NGrad,COUNTIFS('Graduate Preferences'!B500:ZZ500,C499),\"\")","v":""},{"$f":"IF(A499<=NGrad,IF(D499=0,0,MATCH(C499,'Graduate Preferences'!B500:ZZ500,0)),\"\")","v":""},"","","",null,null,null,""]
[497,{"$f":"IF(A500<=NGrad,'Graduate Preferences'!A501,\"\")","v":""},{"$f":"IF(A500<=NGrad,Process!A500,\"\")","v":""},{"$f":"IF(A500<=NGrad,COUNTIFS('Graduate Preferences'!B501:ZZ501,C500),\"\")","v":""},{"$f":"IF(A500<=NGrad,IF(D500=0,0,MATCH(C500,'Graduate Preferences'!B501:ZZ501,0)),\"\")","v":""},"","","",null,null,null,""]
[498,{"$f":"IF(A501<=NGrad,'Graduate Preferences'!A502,\"\")","v":""},{"$f":"IF(A501<=NGrad,Process!A501,\"\")","v":""},{"$f":"IF(A501<=NGrad,COUNTIFS('Graduate Preferences'!B502:ZZ502,C501),\"\")","v":""},{"$f":"IF(A501<=NGrad,IF(D501=0,0,MATCH(C501,'Graduate Preferences'!B502:ZZ502,0)),\"\")","v":""},"","","",null,null,null,""]
[499,{"$f":"IF(A502<=NGrad,'Graduate Preferences'!A503,\"\")","v":""},{"$f":"IF(A502<=NGrad,Process!A502,\"\")","v":""},{"$f":"IF(A502<=NGrad,COUNTIFS('Graduate Preferences'!B503:ZZ503,C502),\"\")","v":""},{"$f":"IF(A502<=NGrad,IF(D502=0,0,MATCH(C502,'Graduate Preferences'!B503:ZZ503,0)),\"\")","v":""},"","","",null,null,null,""]
[500,{"$f":"IF(A503<=NGrad,'Graduate Preferences'!A504,\"\")","v":""},{"$f":"IF(A503<=NGrad,Process!A503,\"\")","v":""},{"$f":"IF(A503<=NGrad,COUNTIFS('Graduate Preferences'!B504:ZZ504,C503),\"\")","v":""},{"$f":"IF(A503<=NGrad,IF(D503=0,0,MATCH(C503,'Graduate Preferences'!B504:ZZ504,0)),\"\")","v":""},"","","",null,null,null,""]
[501,{"$f":"IF(A504<=NGrad,'Graduate Preferences'!A505,\"\")","v":""},{"$f":"IF(A504<=NGrad,Process!A504,\"\")","v":""},{"$f":"IF(A504<=NGrad,COUNTIFS('Graduate Preferences'!B505:ZZ505,C504),\"\")","v":""},{"$f":"IF(A504<=NGrad,IF(D504=0,0,MATCH(C504,'Graduate Preferences'!B505:ZZ505,0)),\"\")","v":""},"","","",null,null,null,""]
[502,{"$f":"IF(A505<=NGrad,'Graduate Preferences'!A506,\"\")","v":""},{"$f":"IF(A505<=NGrad,Process!A505,\"\")","v":""},{"$f":"IF(A505<=NGrad,COUNTIFS('Graduate Preferences'!B506:ZZ506,C505),\"\")","v":""},{"$f":"IF(A505<=NGrad,IF(D505=0,0,MATCH(C505,'Graduate Preferences'!B506:ZZ506,0)),\"\")","v":""},"","","",null,null,null,""]
[503,{"$f":"IF(A506<=NGrad,'Graduate Preferences'!A507,\"\")","v":""},{"$f":"IF(A506<=NGrad,Process!A506,\"\")","v":""},{"$f":"IF(A506<=NGrad,COUNTIFS('Graduate Preferences'!B507:ZZ507,C506),\"\")","v":""},{"$f":"IF(A506<=NGrad,IF(D506=0,0,MATCH(C506,'Graduate Preferences'!B507:ZZ507,0)),\"\")","v":""},"","","",null,null,null,""]
[504,{"$f":"IF(A507<=NGrad,'Graduate Preferences'!A508,\"\")","v":""},{"$f":"IF(A507<=NGrad,Process!A507,\"\")","v":""},{"$f":"IF(A507<=NGrad,COUNTIFS('Graduate Preferences'!B508:ZZ508,C507),\"\")","v":""},{"$f":"IF(A507<=NGrad,IF(D507=0,0,MATCH(C507,'Graduate Preferences'!B508:ZZ508,0)),\"\")","v":""},"","","",null,null,null,""]
[505,{"$f":"IF(A508<=NGrad,'Graduate Preferences'!A509,\"\")","v":""},{"$f":"IF(A508<=NGrad,Process!A508,\"\")","v":""},{"$f":"IF(A508<=NGrad,COUNTIFS('Graduate Preferences'!B509:ZZ509,C508),\"\")","v":""},{"$f":"IF(A508<=NGrad,IF(D508=0,0,MATCH(C508,'Graduate Preferences'!B509:ZZ509,0)),\"\")","v":""},"","","",null,null,null,""]
[506,{"$f":"IF(A509<=NGrad,'Graduate Preferences'!A510,\"\")","v":""},{"$f":"IF(A509<=NGrad,Process!A509,\"\")","v":""},{"$f":"IF(A509<=NGrad,COUNTIFS('Graduate Preferences'!B510:ZZ510,C509),\"\")","v":""},{"$f":"IF(A509<=NGrad,IF(D509=0,0,MATCH(C509,'Graduate Preferences'!B510:ZZ510,0)),\"\")","v":""},"","","",null,null,null,""]
[507,{"$f":"IF(A510<=NGrad,'Graduate Preferences'!A511,\"\")","v":""},{"$f":"IF(A510<=NGrad,Process!A510,\"\")","v":""},{"$f":"IF(A510<=NGrad,COUNTIFS('Graduate Preferences'!B511:ZZ511,C510),\"\")","v":""},{"$f":"IF(A510<=NGrad,IF(D510=0,0,MATCH(C510,'Graduate Preferences'!B511:ZZ511,0)),\"\")","v":""},"","","",null,null,null,""]
[508,{"$f":"IF(A511<=NGrad,'Graduate Preferences'!A512,\"\")","v":""},{"$f":"IF(A511<=NGrad,Process!A511,\"\")","v":""},{"$f":"IF(A511<=NGrad,COUNTIFS('Graduate Preferences'!B512:ZZ512,C511),\"\")","v":""},{"$f":"IF(A511<=NGrad,IF(D511=0,0,MATCH(C511,'Graduate Preferences'!B512:ZZ512,0)),\"\")","v":""},"","","",null,null,null,""]
[509,{"$f":"IF(A512<=NGrad,'Graduate Preferences'!A513,\"\")","v":""},{"$f":"IF(A512<=NGrad,Process!A512,\"\")","v":""},{"$f":"IF(A512<=NGrad,COUNTIFS('Graduate Preferences'!B513:ZZ513,C512),\"\")","v":""},{"$f":"IF(A512<=NGrad,IF(D512=0,0,MATCH(C512,'Graduate Preferences'!B513:ZZ513,0)),\"\")","v":""},"","","",null,null,null,""]
[510,{"$f":"IF(A513<=NGrad,'Graduate Preferences'!A514,\"\")","v":""},{"$f":"IF(A513<=NGrad,Process!A513,\"\")","v":""},{"$f":"IF(A513<=NGrad,COUNTIFS('Graduate Preferences'!B514:ZZ514,C513),\"\")","v":""},{"$f":"IF(A513<=NGrad,IF(D513=0,0,MATCH(C513,'Graduate Preferences'!B514:ZZ514,0)),\"\")","v":""},"","","",null,null,null,""]
[511,{"$f":"IF(A514<=NGrad,'Graduate Preferences'!A515,\"\")","v":""},{"$f":"IF(A514<=NGrad,Process!A514,\"\")","v":""},{"$f":"IF(A514<=NGrad,COUNTIFS('Graduate Preferences'!B515:ZZ515,C514),\"\")","v":""},{"$f":"IF(A514<=NGrad,IF(D514=0,0,MATCH(C514,'Graduate Preferences'!B515:ZZ515,0)),\"\")","v":""},"","","",null,null,null,""]
[512,{"$f":"IF(A515<=NGrad,'Graduate Preferences'!A516,\"\")","v":""},{"$f":"IF(A515<=NGrad,Process!A515,\"\")","v":""},{"$f":"IF(A515<=NGrad,COUNTIFS('Graduate Preferences'!B516:ZZ516,C515),\"\")","v":""},{"$f":"IF(A515<=NGrad,IF(D515=0,0,MATCH(C515,'Graduate Preferences'!B516:ZZ516,0)),\"\")","v":""},"","","",null,null,null,""]
[513,{"$f":"IF(A516<=NGrad,'Graduate Preferences'!A517,\"\")","v":""},{"$f":"IF(A516<=NGrad,Process!A516,\"\")","v":""},{"$f":"IF(A516<=NGrad,COUNTIFS('Graduate Preferences'!B517:ZZ517,C516),\"\")","v":""},{"$f":"IF(A516<=NGrad,IF(D516=0,0,MATCH(C516,'Graduate Preferences'!B517:ZZ517,0)),\"\")","v":""},"","","",null,null,null,""]
[514,{"$f":"IF(A517<=NGrad,'Graduate Preferences'!A518,\"\")","v":""},{"$f":"IF(A517<=NGrad,Process!A517,\"\")","v":""},{"$f":"IF(A517<=NGrad,COUNTIFS('Graduate Preferences'!B518:ZZ518,C517),\"\")","v":""},{"$f":"IF(A517<=NGrad,IF(D517=0,0,MATCH(C517,'Graduate Preferences'!B518:ZZ518,0)),\"\")","v":""},"",{"$f":"IF(F517=\"\",\"\",RANK(F517,F$4:F$1000))","v":""},"",null,null,null,{"$f":"IF(MAX(H$4:H$1000)>=A517,MATCH(A517,H$4:H$1000,0),\"\")","v":""}]
[515,{"$f":"IF(A518<=NGrad,'Graduate Preferences'!A519,\"\")","v":""},{"$f":"IF(A518<=NGrad,Process!A518,\"\")","v":""},{"$f":"IF(A518<=NGrad,COUNTIFS('Graduate Preferences'!B519:ZZ519,C518),\"\")","v":""},{"$f":"IF(A518<=NGrad,IF(D518=0,0,MATCH(C518,'Graduate Preferences'!B519:ZZ519,0)),\"\")","v":""},{"$f":"IF(AND(J518<>\"-\",J518>0,I518=F$2),J518,\"\")","v":""},"",{"$f":"IF(F518=\"\",\"\",MAX(G$4:G$1000)-G518+1)","v":""},null,null,null,""]
[516,{"$f":"IF(A519<=NGrad,'Graduate Preferences'!A520,\"\")","v":""},{"$f":"IF(A519<=NGrad,Process!A519,\"\")","v":""},{"$f":"IF(A519<=NGrad,COUNTIFS('Graduate Preferences'!B520:ZZ520,C519),\"\")","v":""},{"$f":"IF(A519<=NGrad,IF(D519=0,0,MATCH(C519,'Graduate Preferences'!B520:ZZ520,0)),\"\")","v":""},"","","",null,null,null,""]
[517,{"$f":"IF(A520<=NGrad,'Graduate Preferences'!A521,\"\")","v":""},{"$f":"IF(A520<=NGrad,Process!A520,\"\")","v":""},{"$f":"IF(A520<=NGrad,COUNTIFS('Graduate Preferences'!B521:ZZ521,C520),\"\")","v":""},{"$f":"IF(A520<=NGrad,IF(D520=0,0,MATCH(C520,'Graduate Preferences'!B521:ZZ521,0)),\"\")","v":""},"","","",null,null,null,""]
[518,{"$f":"IF(A521<=NGrad,'Graduate Preferences'!A522,\"\")","v":""},{"$f":"IF(A521<=NGrad,Process!A521,\"\")","v":""},{"$f":"IF(A521<=NGrad,COUNTIFS('Graduate Preferences'!B522:ZZ522,C521),\"\")","v":""},{"$f":"IF(A521<=NGrad,IF(D521=0,0,MATCH(C521,'Graduate Preferences'!B522:ZZ522,0)),\"\")","v":""},"","","",null,null,null,""]
[519,{"$f":"IF(A522<=NGrad,'Graduate Preferences'!A523,\"\")","v":""},{"$f":"IF(A522<=NGrad,Process!A522,\"\")","v":""},{"$f":"IF(A522<=NGrad,COUNTIFS('Graduate Preferences'!B523:ZZ523,C522),\"\")","v":""},{"$f":"IF(A522<=NGrad,IF(D522=0,0,MATCH(C522,'Graduate Preferences'!B523:ZZ523,0)),\"\")","v":""},"","","",null,null,null,""]
[520,{"$f":"IF(A523<=NGrad,'Graduate Preferences'!A524,\"\")","v":""},{"$f":"IF(A523<=NGrad,Process!A523,\"\")","v":""},{"$f":"IF(A523<=NGrad,COUNTIFS('Graduate Preferences'!B524:ZZ524,C523),\"\")","v":""},{"$f":"IF(A523<=NGrad,IF(D523=0,0,MATCH(C523,'Graduate Preferences'!B524:ZZ524,0)),\"\")","v":""},"","","",null,null,null,""]
[521,{"$f":"IF(A524<=NGrad,'Graduate Preferences'!A525,\"\")","v":""},{"$f":"IF(A524<=NGrad,Process!A524,\"\")","v":""},{"$f":"IF(A524<=NGrad,COUNTIFS('Graduate Preferences'!B525:ZZ525,C524),\"\")","v":""},{"$f":"IF(A524<=NGrad,IF(D524=0,0,MATCH(C524,'Graduate Preferences'!B525:ZZ525,0)),\"\")","v":""},"","","",null,null,null,""]
[522,{"$f":"IF(A525<=NGrad,'Graduate Preferences'!A526,\"\")","v":""},{"$f":"IF(A525<=NGrad,Process!A525,\"\")","v":""},{"$f":"IF(A525<=NGrad,COUNTIFS('Graduate Preferences'!B526:ZZ526,C525),\"\")","v":""},{"$f":"IF(A525<=NGrad,IF(D525=0,0,MATCH(C525,'Graduate Preferences'!B526:ZZ526,0)),\"\")","v":""},"","","",null,null,null,""]
[523,{"$f":"IF(A526<=NGrad,'Graduate Preferences'!A527,\"\")","v":""},{"$f":"IF(A526<=NGrad,Process!A526,\"\")","v":""},{"$f":"IF(A526<=NGrad,COUNTIFS('Graduate Preferences'!B527:ZZ527,C526),\"\")","v":""},{"$f":"IF(A526<=NGrad,IF(D526=0,0,MATCH(C526,'Graduate Preferences'!B527:ZZ527,0)),\"\")","v":""},"","","",null,null,null,""]
[524,{"$f":"IF(A527<=NGrad,'Graduate Preferences'!A528,\"\")","v":""},{"$f":"IF(A527<=NGrad,Process!A527,\"\")","v":""},{"$f":"IF(A527<=NGrad,COUNTIFS('Graduate Preferences'!B528:ZZ528,C527),\"\")","v":""},{"$f":"IF(A527<=NGrad,IF(D527=0,0,MATCH(C527,'Graduate Preferences'!B528:ZZ528,0)),\"\")","v":""},"","","",null,null,null,""]
[525,{"$f":"IF(A528<=NGrad,'Graduate Preferences'!A529,\"\")","v":""},{"$f":"IF(A528<=NGrad,Process!A528,\"\")","v":""},{"$f":"IF(A528<=NGrad,COUNTIFS('Graduate Preferences'!B529:ZZ529,C528),\"\")","v":""},{"$f":"IF(A528<=NGrad,IF(D528=0,0,MATCH(C528,'Graduate Preferences'!B529:ZZ529,0)),\"\")","v":""},"","","",null,null,null,""]
[526,{"$f":"IF(A529<=NGrad,'Graduate Preferences'!A530,\"\")","v":""},{"$f":"IF(A529<=NGrad,Process!A529,\"\")","v":""},{"$f":"IF(A529<=NGrad,COUNTIFS('Graduate Preferences'!B530:ZZ530,C529),\"\")","v":""},{"$f":"IF(A529<=NGrad,IF(D529=0,0,MATCH(C529,'Graduate Preferences'!B530:ZZ530,0)),\"\")","v":""},"","","",null,null,null,""]
[527,{"$f":"IF(A530<=NGrad,'Graduate Preferences'!A531,\"\")","v":""},{"$f":"IF(A530<=NGrad,Process!A530,\"\")","v":""},{"$f":"IF(A530<=NGrad,COUNTIFS('Graduate Preferences'!B531:ZZ531,C530),\"\")","v":""},{"$f":"IF(A530<=NGrad,IF(D530=0,0,MATCH(C530,'Graduate Preferences'!B531:ZZ531,0)),\"\")","v":""},"","","",null,null,null,""]
[528,{"$f":"IF(A531<=NGrad,'Graduate Preferences'!A532,\"\")","v":""},{"$f":"IF(A531<=NGrad,Process!A531,\"\")","v":""},{"$f":"IF(A531<=NGrad,COUNTIFS('Graduate Preferences'!B532:ZZ532,C531),\"\")","v":""},{"$f":"IF(A531<=NGrad,IF(D531=0,0,MATCH(C531,'Graduate Preferences'!B532:ZZ532,0)),\"\")","v":""},"","","",null,null,null,""]
[529,{"$f":"IF(A532<=NGrad,'Graduate Preferences'!A533,\"\")","v":""},{"$f":"IF(A532<=NGrad,Process!A532,\"\")","v":""},{"$f":"IF(A532<=NGrad,COUNTIFS('Graduate Preferences'!B533:ZZ533,C532),\"\")","v":""},{"$f":"IF(A532<=NGrad,IF(D532=0,0,MATCH(C532,'Graduate Preferences'!B533:ZZ533,0)),\"\")","v":""},"","","",null,null,null,""]
[530,{"$f":"IF(A533<=NGrad,'Graduate Preferences'!A534,\"\")","v":""},{"$f":"IF(A533<=NGrad,Process!A533,\"\")","v":""},{"$f":"IF(A533<=NGrad,COUNTIFS('Graduate Preferences'!B534:ZZ534,C533),\"\")","v":""},{"$f":"IF(A533<=NGrad,IF(D533=0,0,MATCH(C533,'Graduate Preferences'!B534:ZZ534,0)),\"\")","v":""},"","","",null,null,null,""]
[531,{"$f":"IF(A534<=NGrad,'Graduate Preferences'!A535,\"\")","v":""},{"$f":"IF(A534<=NGrad,Process!A534,\"\")","v":""},{"$f":"IF(A534<=NGrad,COUNTIFS('Graduate Preferences'!B535:ZZ535,C534),\"\")","v":""},{"$f":"IF(A534<=NGrad,IF(D534=0,0,MATCH(C534,'Graduate Preferences'!B535:ZZ535,0)),\"\")","v":""},"","","",null,null,null,""]
[532,{"$f":"IF(A535<=NGrad,'Graduate Preferences'!A536,\"\")","v":""},{"$f":"IF(A535<=NGrad,Process!A535,\"\")","v":""},{"$f":"IF(A535<=NGrad,COUNTIFS('Graduate Preferences'!B536:ZZ536,C535),\"\")","v":""},{"$f":"IF(A535<=NGrad,IF(D535=0,0,MATCH(C535,'Graduate Preferences'!B536:ZZ536,0)),\"\")","v":""},"","","",null,null,null,""]
[533,{"$f":"IF(A536<=NGrad,'Graduate Preferences'!A537,\"\")","v":""},{"$f":"IF(A536<=NGrad,Process!A536,\"\")","v":""},{"$f":"IF(A536<=NGrad,COUNTIFS('Graduate Preferences'!B537:ZZ537,C536),\"\")","v":""},{"$f":"IF(A536<=NGrad,IF(D536=0,0,MATCH(C536,'Graduate Preferences'!B537:ZZ537,0)),\"\")","v":""},"","","",null,null,null,""]
[534,{"$f":"IF(A537<=NGrad,'Graduate Preferences'!A538,\"\")","v":""},{"$f":"IF(A537<=NGrad,Process!A537,\"\")","v":""},{"$f":"IF(A537<=NGrad,COUNTIFS('Graduate Preferences'!B538:ZZ538,C537),\"\")","v":""},{"$f":"IF(A537<=NGrad,IF(D537=0,0,MATCH(C537,'Graduate Preferences'!B538:ZZ538,0)),\"\")","v":""},"","","",null,null,null,""]
[535,{"$f":"IF(A538<=NGrad,'Graduate Preferences'!A539,\"\")","v":""},{"$f":"IF(A538<=NGrad,Process!A538,\"\")","v":""},{"$f":"IF(A538<=NGrad,COUNTIFS('Graduate Preferences'!B539:ZZ539,C538),\"\")","v":""},{"$f":"IF(A538<=NGrad,IF(D538=0,0,MATCH(C538,'Graduate Preferences'!B539:ZZ539,0)),\"\")","v":""},"","","",null,null,null,""]
[536,{"$f":"IF(A539<=NGrad,'Graduate Preferences'!A540,\"\")","v":""},{"$f":"IF(A539<=NGrad,Process!A539,\"\")","v":""},{"$f":"IF(A539<=NGrad,COUNTIFS('Graduate Preferences'!B540:ZZ540,C539),\"\")","v":""},{"$f":"IF(A539<=NGrad,IF(D539=0,0,MATCH(C539,'Graduate Preferences'!B540:ZZ540,0)),\"\")","v":""},"","","",null,null,null,""]
[537,{"$f":"IF(A540<=NGrad,'Graduate Preferences'!A541,\"\")","v":""},{"$f":"IF(A540<=NGrad,Process!A540,\"\")","v":""},{"$f":"IF(A540<=NGrad,COUNTIFS('Graduate Preferences'!B541:ZZ541,C540),\"\")","v":""},{"$f":"IF(A540<=NGrad,IF(D540=0,0,MATCH(C540,'Graduate Preferences'!B541:ZZ541,0)),\"\")","v":""},"","","",null,null,null,""]
[538,{"$f":"IF(A541<=NGrad,'Graduate Preferences'!A542,\"\")","v":""},{"$f":"IF(A541<=NGrad,Process!A541,\"\")","v":""},{"$f":"IF(A541<=NGrad,COUNTIFS('Graduate Preferences'!B542:ZZ542,C541),\"\")","v":""},{"$f":"IF(A541<=NGrad,IF(D541=0,0,MATCH(C541,'Graduate Preferences'!B542:ZZ542,0)),\"\")","v":""},"","","",null,null,null,""]
[539,{"$f":"IF(A542<=NGrad,'Graduate Preferences'!A543,\"\")","v":""},{"$f":"IF(A542<=NGrad,Process!A542,\"\")","v":""},{"$f":"IF(A542<=NGrad,COUNTIFS('Graduate Preferences'!B543:ZZ543,C542),\"\")","v":""},{"$f":"IF(A542<=NGrad,IF(D542=0,0,MATCH(C542,'Graduate Preferences'!B543:ZZ543,0)),\"\")","v":""},"","","",null,null,null,""]
[540,{"$f":"IF(A543<=NGrad,'Graduate Preferences'!A544,\"\")","v":""},{"$f":"IF(A543<=NGrad,Process!A543,\"\")","v":""},{"$f":"IF(A543<=NGrad,COUNTIFS('Graduate Preferences'!B544:ZZ544,C543),\"\")","v":""},{"$f":"IF(A543<=NGrad,IF(D543=0,0,MATCH(C543,'Graduate Preferences'!B544:ZZ544,0)),\"\")","v":""},"","","",null,null,null,""]
[541,{"$f":"IF(A544<=NGrad,'Graduate Preferences'!A545,\"\")","v":""},{"$f":"IF(A544<=NGrad,Process!A544,\"\")","v":""},{"$f":"IF(A544<=NGrad,COUNTIFS('Graduate Preferences'!B545:ZZ545,C544),\"\")","v":""},{"$f":"IF(A544<=NGrad,IF(D544=0,0,MATCH(C544,'Graduate Preferences'!B545:ZZ545,0)),\"\")","v":""},"","","",null,null,null,""]
[542,{"$f":"IF(A545<=NGrad,'Graduate Preferences'!A546,\"\")","v":""},{"$f":"IF(A545<=NGrad,Process!A545,\"\")","v":""},{"$f":"IF(A545<=NGrad,COUNTIFS('Graduate Preferences'!B546:ZZ546,C545),\"\")","v":""},{"$f":"IF(A545<=NGrad,IF(D545=0,0,MATCH(C545,'Graduate Preferences'!B546:ZZ546,0)),\"\")","v":""},"","","",null,null,null,""]
[543,{"$f":"IF(A546<=NGrad,'Graduate Preferences'!A547,\"\")","v":""},{"$f":"IF(A546<=NGrad,Process!A546,\"\")","v":""},{"$f":"IF(A546<=NGrad,COUNTIFS('Graduate Preferences'!B547:ZZ547,C546),\"\")","v":""},{"$f":"IF(A546<=NGrad,IF(D546=0,0,MATCH(C546,'Graduate Preferences'!B547:ZZ547,0)),\"\")","v":""},"","","",null,null,null,""]
[544,{"$f":"IF(A547<=NGrad,'Graduate Preferences'!A548,\"\")","v":""},{"$f":"IF(A547<=NGrad,Process!A547,\"\")","v":""},{"$f":"IF(A547<=NGrad,COUNTIFS('Graduate Preferences'!B548:ZZ548,C547),\"\")","v":""},{"$f":"IF(A547<=NGrad,IF(D547=0,0,MATCH(C547,'Graduate Preferences'!B548:ZZ548,0)),\"\")","v":""},"","","",null,null,null,""]
[545,{"$f":"IF(A548<=NGrad,'Graduate Preferences'!A549,\"\")","v":""},{"$f":"IF(A548<=NGrad,Process!A548,\"\")","v":""},{"$f":"IF(A548<=NGrad,COUNTIFS('Graduate Preferences'!B549:ZZ549,C548),\"\")","v":""},{"$f":"IF(A548<=NGrad,IF(D548=0,0,MATCH(C548,'Graduate Preferences'!B549:ZZ549,0)),\"\")","v":""},"","","",null,null,null,""]
[546,{"$f":"IF(A549<=NGrad,'Graduate Preferences'!A550,\"\")","v":""},{"$f":"IF(A549<=NGrad,Process!A549,\"\")","v":""},{"$f":"IF(A549<=NGrad,COUNTIFS('Graduate Preferences'!B550:ZZ550,C549),\"\")","v":""},{"$f":"IF(A549<=NGrad,IF(D549=0,0,MATCH(C549,'Graduate Preferences'!B550:ZZ550,0)),\"\")","v":""},"","","",null,null,null,""]
[547,{"$f":"IF(A550<=NGrad,'Graduate Preferences'!A551,\"\")","v":""},{"$f":"IF(A550<=NGrad,Process!A550,\"\")","v":""},{"$f":"IF(A550<=NGrad,COUNTIFS('Graduate Preferences'!B551:ZZ551,C550),\"\")","v":""},{"$f":"IF(A550<=NGrad,IF(D550=0,0,MATCH(C550,'Graduate Preferences'!B551:ZZ551,0)),\"\")","v":""},"","","",null,null,null,""]
[548,{"$f":"IF(A551<=NGrad,'Graduate Preferences'!A552,\"\")","v":""},{"$f":"IF(A551<=NGrad,Process!A551,\"\")","v":""},{"$f":"IF(A551<=NGrad,COUNTIFS('Graduate Preferences'!B552:ZZ552,C551),\"\")","v":""},{"$f":"IF(A551<=NGrad,IF(D551=0,0,MATCH(C551,'Graduate Preferences'!B552:ZZ552,0)),\"\")","v":""},"","","",null,null,null,""]
[549,{"$f":"IF(A552<=NGrad,'Graduate Preferences'!A553,\"\")","v":""},{"$f":"IF(A552<=NGrad,Process!A552,\"\")","v":""},{"$f":"IF(A552<=NGrad,COUNTIFS('Graduate Preferences'!B553:ZZ553,C552),\"\")","v":""},{"$f":"IF(A552<=NGrad,IF(D552=0,0,MATCH(C552,'Graduate Preferences'!B553:ZZ553,0)),\"\")","v":""},"","","",null,null,null,""]
[550,{"$f":"IF(A553<=NGrad,'Graduate Preferences'!A554,\"\")","v":""},{"$f":"IF(A553<=NGrad,Process!A553,\"\")","v":""},{"$f":"IF(A553<=NGrad,COUNTIFS('Graduate Preferences'!B554:ZZ554,C553),\"\")","v":""},{"$f":"IF(A553<=NGrad,IF(D553=0,0,MATCH(C553,'Graduate Preferences'!B554:ZZ554,0)),\"\")","v":""},"","","",null,null,null,""]
[551,{"$f":"IF(A554<=NGrad,'Graduate Preferences'!A555,\"\")","v":""},{"$f":"IF(A554<=NGrad,Process!A554,\"\")","v":""},{"$f":"IF(A554<=NGrad,COUNTIFS('Graduate Preferences'!B555:ZZ555,C554),\"\")","v":""},{"$f":"IF(A554<=NGrad,IF(D554=0,0,MATCH(C554,'Graduate Preferences'!B555:ZZ555,0)),\"\")","v":""},"","","",null,null,null,""]
[552,{"$f":"IF(A555<=NGrad,'Graduate Preferences'!A556,\"\")","v":""},{"$f":"IF(A555<=NGrad,Process!A555,\"\")","v":""},{"$f":"IF(A555<=NGrad,COUNTIFS('Graduate Preferences'!B556:ZZ556,C555),\"\")","v":""},{"$f":"IF(A555<=NGrad,IF(D555=0,0,MATCH(C555,'Graduate Preferences'!B556:ZZ556,0)),\"\")","v":""},"","","",null,null,null,""]
[553,{"$f":"IF(A556<=NGrad,'Graduate Preferences'!A557,\"\")","v":""},{"$f":"IF(A556<=NGrad,Process!A556,\"\")","v":""},{"$f":"IF(A556<=NGrad,COUNTIFS('Graduate Preferences'!B557:ZZ557,C556),\"\")","v":""},{"$f":"IF(A556<=NGrad,IF(D556=0,0,MATCH(C556,'Graduate Preferences'!B557:ZZ557,0)),\"\")","v":""},"","","",null,null,null,""]
[554,{"$f":"IF(A557<=NGrad,'Graduate Preferences'!A558,\"\")","v":""},{"$f":"IF(A557<=NGrad,Process!A557,\"\")","v":""},{"$f":"IF(A557<=NGrad,COUNTIFS('Graduate Preferences'!B558:ZZ558,C557),\"\")","v":""},{"$f":"IF(A557<=NGrad,IF(D557=0,0,MATCH(C557,'Graduate Preferences'!B558:ZZ558,0)),\"\")","v":""},"","","",null,null,null,""]
[555,{"$f":"IF(A558<=NGrad,'Graduate Preferences'!A559,\"\")","v":""},{"$f":"IF(A558<=NGrad,Process!A558,\"\")","v":""},{"$f":"IF(A558<=NGrad,COUNTIFS('Graduate Preferences'!B559:ZZ559,C558),\"\")","v":""},{"$f":"IF(A558<=NGrad,IF(D558=0,0,MATCH(C558,'Graduate Preferences'!B559:ZZ559,0)),\"\")","v":""},"","","",null,null,null,""]
[556,{"$f":"IF(A559<=NGrad,'Graduate Preferences'!A560,\"\")","v":""},{"$f":"IF(A559<=NGrad,Process!A559,\"\")","v":""},{"$f":"IF(A559<=NGrad,COUNTIFS('Graduate Preferences'!B560:ZZ560,C559),\"\")","v":""},{"$f":"IF(A559<=NGrad,IF(D559=0,0,MATCH(C559,'Graduate Preferences'!B560:ZZ560,0)),\"\")","v":""},"","","",null,null,null,""]
[557,{"$f":"IF(A560<=NGrad,'Graduate Preferences'!A561,\"\")","v":""},{"$f":"IF(A560<=NGrad,Process!A560,\"\")","v":""},{"$f":"IF(A560<=NGrad,COUNTIFS('Graduate Preferences'!B561:ZZ561,C560),\"\")","v":""},{"$f":"IF(A560<=NGrad,IF(D560=0,0,MATCH(C560,'Graduate Preferences'!B561:ZZ561,0)),\"\")","v":""},"","","",null,null,null,""]
[558,{"$f":"IF(A561<=NGrad,'Graduate Preferences'!A562,\"\")","v":""},{"$f":"IF(A561<=NGrad,Process!A561,\"\")","v":""},{"$f":"IF(A561<=NGrad,COUNTIFS('Graduate Preferences'!B562:ZZ562,C561),\"\")","v":""},{"$f":"IF(A561<=NGrad,IF(D561=0,0,MATCH(C561,'Graduate Preferences'!B562:ZZ562,0)),\"\")","v":""},"","","",null,null,null,""]
[559,{"$f":"IF(A562<=NGrad,'Graduate Preferences'!A563,\"\")","v":""},{"$f":"IF(A562<=NGrad,Process!A562,\"\")","v":""},{"$f":"IF(A562<=NGrad,COUNTIFS('Graduate Preferences'!B563:ZZ563,C562),\"\")","v":""},{"$f":"IF(A562<=NGrad,IF(D562=0,0,MATCH(C562,'Graduate Preferences'!B563:ZZ563,0)),\"\")","v":""},"","","",null,null,null,""]
[560,{"$f":"IF(A563<=NGrad,'Graduate Preferences'!A564,\"\")","v":""},{"$f":"IF(A563<=NGrad,Process!A563,\"\")","v":""},{"$f":"IF(A563<=NGrad,COUNTIFS('Graduate Preferences'!B564:ZZ564,C563),\"\")","v":""},{"$f":"IF(A563<=NGrad,IF(D563=0,0,MATCH(C563,'Graduate Preferences'!B564:ZZ564,0)),\"\")","v":""},"","","",null,null,null,""]
[561,{"$f":"IF(A564<=NGrad,'Graduate Preferences'!A565,\"\")","v":""},{"$f":"IF(A564<=NGrad,Process!A564,\"\")","v":""},{"$f":"IF(A564<=NGrad,COUNTIFS('Graduate Preferences'!B565:ZZ565,C564),\"\")","v":""},{"$f":"IF(A564<=NGrad,IF(D564=0,0,MATCH(C564,'Graduate Preferences'!B565:ZZ565,0)),\"\")","v":""},"","","",null,null,null,""]
[562,{"$f":"IF(A565<=NGrad,'Graduate Preferences'!A566,\"\")","v":""},{"$f":"IF(A565<=NGrad,Process!A565,\"\")","v":""},{"$f":"IF(A565<=NGrad,COUNTIFS('Graduate Preferences'!B566:ZZ566,C565),\"\")","v":""},{"$f":"IF(A565<=NGrad,IF(D565=0,0,MATCH(C565,'Graduate Preferences'!B566:ZZ566,0)),\"\")","v":""},"","","",null,null,null,""]
[563,{"$f":"IF(A566<=NGrad,'Graduate Preferences'!A567,\"\")","v":""},{"$f":"IF(A566<=NGrad,Process!A566,\"\")","v":""},{"$f":"IF(A566<=NGrad,COUNTIFS('Graduate Preferences'!B567:ZZ567,C566),\"\")","v":""},{"$f":"IF(A566<=NGrad,IF(D566=0,0,MATCH(C566,'Graduate Preferences'!B567:ZZ567,0)),\"\")","v":""},"","","",null,null,null,""]
[564,{"$f":"IF(A567<=NGrad,'Graduate Preferences'!A568,\"\")","v":""},{"$f":"IF(A567<=NGrad,Process!A567,\"\")","v":""},{"$f":"IF(A567<=NGrad,COUNTIFS('Graduate Preferences'!B568:ZZ568,C567),\"\")","v":""},{"$f":"IF(A567<=NGrad,IF(D567=0,0,MATCH(C567,'Graduate Preferences'!B568:ZZ568,0)),\"\")","v":""},"","","",null,null,null,""]
[565,{"$f":"IF(A568<=NGrad,'Graduate Preferences'!A569,\"\")","v":""},{"$f":"IF(A568<=NGrad,Process!A568,\"\")","v":""},{"$f":"IF(A568<=NGrad,COUNTIFS('Graduate Preferences'!B569:ZZ569,C568),\"\")","v":""},{"$f":"IF(A568<=NGrad,IF(D568=0,0,MATCH(C568,'Graduate Preferences'!B569:ZZ569,0)),\"\")","v":""},"","","",null,null,null,""]
[566,{"$f":"IF(A569<=NGrad,'Graduate Preferences'!A570,\"\")","v":""},{"$f":"IF(A569<=NGrad,Process!A569,\"\")","v":""},{"$f":"IF(A569<=NGrad,COUNTIFS('Graduate Preferences'!B570:ZZ570,C569),\"\")","v":""},{"$f":"IF(A569<=NGrad,IF(D569=0,0,MATCH(C569,'Graduate Preferences'!B570:ZZ570,0)),\"\")","v":""},"","","",null,null,null,""]
[567,{"$f":"IF(A570<=NGrad,'Graduate Preferences'!A571,\"\")","v":""},{"$f":"IF(A570<=NGrad,Process!A570,\"\")","v":""},{"$f":"IF(A570<=NGrad,COUNTIFS('Graduate Preferences'!B571:ZZ571,C570),\"\")","v":""},{"$f":"IF(A570<=NGrad,IF(D570=0,0,MATCH(C570,'Graduate Preferences'!B571:ZZ571,0)),\"\")","v":""},"","","",null,null,null,""]
[568,{"$f":"IF(A571<=NGrad,'Graduate Preferences'!A572,\"\")","v":""},{"$f":"IF(A571<=NGrad,Process!A571,\"\")","v":""},{"$f":"IF(A571<=NGrad,COUNTIFS('Graduate Preferences'!B572:ZZ572,C571),\"\")","v":""},{"$f":"IF(A571<=NGrad,IF(D571=0,0,MATCH(C571,'Graduate Preferences'!B572:ZZ572,0)),\"\")","v":""},"","","",null,null,null,""]
[569,{"$f":"IF(A572<=NGrad,'Graduate Preferences'!A573,\"\")","v":""},{"$f":"IF(A572<=NGrad,Process!A572,\"\")","v":""},{"$f":"IF(A572<=NGrad,COUNTIFS('Graduate Preferences'!B573:ZZ573,C572),\"\")","v":""},{"$f":"IF(A572<=NGrad,IF(D572=0,0,MATCH(C572,'Graduate Preferences'!B573:ZZ573,0)),\"\")","v":""},"","","",null,null,null,""]
[570,{"$f":"IF(A573<=NGrad,'Graduate Preferences'!A574,\"\")","v":""},{"$f":"IF(A573<=NGrad,Process!A573,\"\")","v":""},{"$f":"IF(A573<=NGrad,COUNTIFS('Graduate Preferences'!B574:ZZ574,C573),\"\")","v":""},{"$f":"IF(A573<=NGrad,IF(D573=0,0,MATCH(C573,'Graduate Preferences'!B574:ZZ574,0)),\"\")","v":""},"","","",null,null,null,""]
[571,{"$f":"IF(A574<=NGrad,'Graduate Preferences'!A575,\"\")","v":""},{"$f":"IF(A574<=NGrad,Process!A574,\"\")","v":""},{"$f":"IF(A574<=NGrad,COUNTIFS('Graduate Preferences'!B575:ZZ575,C574),\"\")","v":""},{"$f":"IF(A574<=NGrad,IF(D574=0,0,MATCH(C574,'Graduate Preferences'!B575:ZZ575,0)),\"\")","v":""},"","","",null,null,null,""]
[572,{"$f":"IF(A575<=NGrad,'Graduate Preferences'!A576,\"\")","v":""},{"$f":"IF(A575<=NGrad,Process!A575,\"\")","v":""},{"$f":"IF(A575<=NGrad,COUNTIFS('Graduate Preferences'!B576:ZZ576,C575),\"\")","v":""},{"$f":"IF(A575<=NGrad,IF(D575=0,0,MATCH(C575,'Graduate Preferences'!B576:ZZ576,0)),\"\")","v":""},"","","",null,null,null,""]
[573,{"$f":"IF(A576<=NGrad,'Graduate Preferences'!A577,\"\")","v":""},{"$f":"IF(A576<=NGrad,Process!A576,\"\")","v":""},{"$f":"IF(A576<=NGrad,COUNTIFS('Graduate Preferences'!B577:ZZ577,C576),\"\")","v":""},{"$f":"IF(A576<=NGrad,IF(D576=0,0,MATCH(C576,'Graduate Preferences'!B577:ZZ577,0)),\"\")","v":""},"","","",null,null,null,""]
[574,{"$f":"IF(A577<=NGrad,'Graduate Preferences'!A578,\"\")","v":""},{"$f":"IF(A577<=NGrad,Process!A577,\"\")","v":""},{"$f":"IF(A577<=NGrad,COUNTIFS('Graduate Preferences'!B578:ZZ578,C577),\"\")","v":""},{"$f":"IF(A577<=NGrad,IF(D577=0,0,MATCH(C577,'Graduate Preferences'!B578:ZZ578,0)),\"\")","v":""},"","","",null,null,null,""]
[575,{"$f":"IF(A578<=NGrad,'Graduate Preferences'!A579,\"\")","v":""},{"$f":"IF(A578<=NGrad,Process!A578,\"\")","v":""},{"$f":"IF(A578<=NGrad,COUNTIFS('Graduate Preferences'!B579:ZZ579,C578),\"\")","v":""},{"$f":"IF(A578<=NGrad,IF(D578=0,0,MATCH(C578,'Graduate Preferences'!B579:ZZ579,0)),\"\")","v":""},"","","",null,null,null,""]
[576,{"$f":"IF(A579<=NGrad,'Graduate Preferences'!A580,\"\")","v":""},{"$f":"IF(A579<=NGrad,Process!A579,\"\")","v":""},{"$f":"IF(A579<=NGrad,COUNTIFS('Graduate Preferences'!B580:ZZ580,C579),\"\")","v":""},{"$f":"IF(A579<=NGrad,IF(D579=0,0,MATCH(C579,'Graduate Preferences'!B580:ZZ580,0)),\"\")","v":""},"","","",null,null,null,""]
[577,{"$f":"IF(A580<=NGrad,'Graduate Preferences'!A581,\"\")","v":""},{"$f":"IF(A580<=NGrad,Process!A580,\"\")","v":""},{"$f":"IF(A580<=NGrad,COUNTIFS('Graduate Preferences'!B581:ZZ581,C580),\"\")","v":""},{"$f":"IF(A580<=NGrad,IF(D580=0,0,MATCH(C580,'Graduate Preferences'!B581:ZZ581,0)),\"\")","v":""},"","","",null,null,null,""]
[578,{"$f":"IF(A581<=NGrad,'Graduate Preferences'!A582,\"\")","v":""},{"$f":"IF(A581<=NGrad,Process!A581,\"\")","v":""},{"$f":"IF(A581<=NGrad,COUNTIFS('Graduate Preferences'!B582:ZZ582,C581),\"\")","v":""},{"$f":"IF(A581<=NGrad,IF(D581=0,0,MATCH(C581,'Graduate Preferences'!B582:ZZ582,0)),\"\")","v":""},"",{"$f":"IF(F581=\"\",\"\",RANK(F581,F$4:F$1000))","v":""},"",null,null,null,{"$f":"IF(MAX(H$4:H$1000)>=A581,MATCH(A581,H$4:H$1000,0),\"\")","v":""}]
[579,{"$f":"IF(A582<=NGrad,'Graduate Preferences'!A583,\"\")","v":""},{"$f":"IF(A582<=NGrad,Process!A582,\"\")","v":""},{"$f":"IF(A582<=NGrad,COUNTIFS('Graduate Preferences'!B583:ZZ583,C582),\"\")","v":""},{"$f":"IF(A582<=NGrad,IF(D582=0,0,MATCH(C582,'Graduate Preferences'!B583:ZZ583,0)),\"\")","v":""},{"$f":"IF(AND(J582<>\"-\",J582>0,I582=F$2),J582,\"\")","v":""},"",{"$f":"IF(F582=\"\",\"\",MAX(G$4:G$1000)-G582+1)","v":""},null,null,null,""]
[580,{"$f":"IF(A583<=NGrad,'Graduate Preferences'!A584,\"\")","v":""},{"$f":"IF(A583<=NGrad,Process!A583,\"\")","v":""},{"$f":"IF(A583<=NGrad,COUNTIFS('Graduate Preferences'!B584:ZZ584,C583),\"\")","v":""},{"$f":"IF(A583<=NGrad,IF(D583=0,0,MATCH(C583,'Graduate Preferences'!B584:ZZ584,0)),\"\")","v":""},"","","",null,null,null,""]
[581,{"$f":"IF(A584<=NGrad,'Graduate Preferences'!A585,\"\")","v":""},{"$f":"IF(A584<=NGrad,Process!A584,\"\")","v":""},{"$f":"IF(A584<=NGrad,COUNTIFS('Graduate Preferences'!B585:ZZ585,C584),\"\")","v":""},{"$f":"IF(A584<=NGrad,IF(D584=0,0,MATCH(C584,'Graduate Preferences'!B585:ZZ585,0)),\"\")","v":""},"","","",null,null,null,""]
[582,{"$f":"IF(A585<=NGrad,'Graduate Preferences'!A586,\"\")","v":""},{"$f":"IF(A585<=NGrad,Process!A585,\"\")","v":""},{"$f":"IF(A585<=NGrad,COUNTIFS('Graduate Preferences'!B586:ZZ586,C585),\"\")","v":""},{"$f":"IF(A585<=NGrad,IF(D585=0,0,MATCH(C585,'Graduate Preferences'!B586:ZZ586,0)),\"\")","v":""},"","","",null,null,null,""]
[583,{"$f":"IF(A586<=NGrad,'Graduate Preferences'!A587,\"\")","v":""},{"$f":"IF(A586<=NGrad,Process!A586,\"\")","v":""},{"$f":"IF(A586<=NGrad,COUNTIFS('Graduate Preferences'!B587:ZZ587,C586),\"\")","v":""},{"$f":"IF(A586<=NGrad,IF(D586=0,0,MATCH(C586,'Graduate Preferences'!B587:ZZ587,0)),\"\")","v":""},"","","",null,null,null,""]
[584,{"$f":"IF(A587<=NGrad,'Graduate Preferences'!A588,\"\")","v":""},{"$f":"IF(A587<=NGrad,Process!A587,\"\")","v":""},{"$f":"IF(A587<=NGrad,COUNTIFS('Graduate Preferences'!B588:ZZ588,C587),\"\")","v":""},{"$f":"IF(A587<=NGrad,IF(D587=0,0,MATCH(C587,'Graduate Preferences'!B588:ZZ588,0)),\"\")","v":""},"","","",null,null,null,""]
[585,{"$f":"IF(A588<=NGrad,'Graduate Preferences'!A589,\"\")","v":""},{"$f":"IF(A588<=NGrad,Process!A588,\"\")","v":""},{"$f":"IF(A588<=NGrad,COUNTIFS('Graduate Preferences'!B589:ZZ589,C588),\"\")","v":""},{"$f":"IF(A588<=NGrad,IF(D588=0,0,MATCH(C588,'Graduate Preferences'!B589:ZZ589,0)),\"\")","v":""},"","","",null,null,null,""]
[586,{"$f":"IF(A589<=NGrad,'Graduate Preferences'!A590,\"\")","v":""},{"$f":"IF(A589<=NGrad,Process!A589,\"\")","v":""},{"$f":"IF(A589<=NGrad,COUNTIFS('Graduate Preferences'!B590:ZZ590,C589),\"\")","v":""},{"$f":"IF(A589<=NGrad,IF(D589=0,0,MATCH(C589,'Graduate Preferences'!B590:ZZ590,0)),\"\")","v":""},"","","",null,null,null,""]
[587,{"$f":"IF(A590<=NGrad,'Graduate Preferences'!A591,\"\")","v":""},{"$f":"IF(A590<=NGrad,Process!A590,\"\")","v":""},{"$f":"IF(A590<=NGrad,COUNTIFS('Graduate Preferences'!B591:ZZ591,C590),\"\")","v":""},{"$f":"IF(A590<=NGrad,IF(D590=0,0,MATCH(C590,'Graduate Preferences'!B591:ZZ591,0)),\"\")","v":""},"","","",null,null,null,""]
[588,{"$f":"IF(A591<=NGrad,'Graduate Preferences'!A592,\"\")","v":""},{"$f":"IF(A591<=NGrad,Process!A591,\"\")","v":""},{"$f":"IF(A591<=NGrad,COUNTIFS('Graduate Preferences'!B592:ZZ592,C591),\"\")","v":""},{"$f":"IF(A591<=NGrad,IF(D591=0,0,MATCH(C591,'Graduate Preferences'!B592:ZZ592,0)),\"\")","v":""},"","","",null,null,null,""]
[589,{"$f":"IF(A592<=NGrad,'Graduate Preferences'!A593,\"\")","v":""},{"$f":"IF(A592<=NGrad,Process!A592,\"\")","v":""},{"$f":"IF(A592<=NGrad,COUNTIFS('Graduate Preferences'!B593:ZZ593,C592),\"\")","v":""},{"$f":"IF(A592<=NGrad,IF(D592=0,0,MATCH(C592,'Graduate Preferences'!B593:ZZ593,0)),\"\")","v":""},"","","",null,null,null,""]
[590,{"$f":"IF(A593<=NGrad,'Graduate Preferences'!A594,\"\")","v":""},{"$f":"IF(A593<=NGrad,Process!A593,\"\")","v":""},{"$f":"IF(A593<=NGrad,COUNTIFS('Graduate Preferences'!B594:ZZ594,C593),\"\")","v":""},{"$f":"IF(A593<=NGrad,IF(D593=0,0,MATCH(C593,'Graduate Preferences'!B594:ZZ594,0)),\"\")","v":""},"","","",null,null,null,""]
[591,{"$f":"IF(A594<=NGrad,'Graduate Preferences'!A595,\"\")","v":""},{"$f":"IF(A594<=NGrad,Process!A594,\"\")","v":""},{"$f":"IF(A594<=NGrad,COUNTIFS('Graduate Preferences'!B595:ZZ595,C594),\"\")","v":""},{"$f":"IF(A594<=NGrad,IF(D594=0,0,MATCH(C594,'Graduate Preferences'!B595:ZZ595,0)),\"\")","v":""},"","","",null,null,null,""]
[592,{"$f":"IF(A595<=NGrad,'Graduate Preferences'!A596,\"\")","v":""},{"$f":"IF(A595<=NGrad,Process!A595,\"\")","v":""},{"$f":"IF(A595<=NGrad,COUNTIFS('Graduate Preferences'!B596:ZZ596,C595),\"\")","v":""},{"$f":"IF(A595<=NGrad,IF(D595=0,0,MATCH(C595,'Graduate Preferences'!B596:ZZ596,0)),\"\")","v":""},"","","",null,null,null,""]
[593,{"$f":"IF(A596<=NGrad,'Graduate Preferences'!A597,\"\")","v":""},{"$f":"IF(A596<=NGrad,Process!A596,\"\")","v":""},{"$f":"IF(A596<=NGrad,COUNTIFS('Graduate Preferences'!B597:ZZ597,C596),\"\")","v":""},{"$f":"IF(A596<=NGrad,IF(D596=0,0,MATCH(C596,'Graduate Preferences'!B597:ZZ597,0)),\"\")","v":""},"","","",null,null,null,""]
[594,{"$f":"IF(A597<=NGrad,'Graduate Preferences'!A598,\"\")","v":""},{"$f":"IF(A597<=NGrad,Process!A597,\"\")","v":""},{"$f":"IF(A597<=NGrad,COUNTIFS('Graduate Preferences'!B598:ZZ598,C597),\"\")","v":""},{"$f":"IF(A597<=NGrad,IF(D597=0,0,MATCH(C597,'Graduate Preferences'!B598:ZZ598,0)),\"\")","v":""},"","","",null,null,null,""]
[595,{"$f":"IF(A598<=NGrad,'Graduate Preferences'!A599,\"\")","v":""},{"$f":"IF(A598<=NGrad,Process!A598,\"\")","v":""},{"$f":"IF(A598<=NGrad,COUNTIFS('Graduate Preferences'!B599:ZZ599,C598),\"\")","v":""},{"$f":"IF(A598<=NGrad,IF(D598=0,0,MATCH(C598,'Graduate Preferences'!B599:ZZ599,0)),\"\")","v":""},"","","",null,null,null,""]
[596,{"$f":"IF(A599<=NGrad,'Graduate Preferences'!A600,\"\")","v":""},{"$f":"IF(A599<=NGrad,Process!A599,\"\")","v":""},{"$f":"IF(A599<=NGrad,COUNTIFS('Graduate Preferences'!B600:ZZ600,C599),\"\")","v":""},{"$f":"IF(A599<=NGrad,IF(D599=0,0,MATCH(C599,'Graduate Preferences'!B600:ZZ600,0)),\"\")","v":""},"","","",null,null,null,""]
[597,{"$f":"IF(A600<=NGrad,'Graduate Preferences'!A601,\"\")","v":""},{"$f":"IF(A600<=NGrad,Process!A600,\"\")","v":""},{"$f":"IF(A600<=NGrad,COUNTIFS('Graduate Preferences'!B601:ZZ601,C600),\"\")","v":""},{"$f":"IF(A600<=NGrad,IF(D600=0,0,MATCH(C600,'Graduate Preferences'!B601:ZZ601,0)),\"\")","v":""},"","","",null,null,null,""]
[598,{"$f":"IF(A601<=NGrad,'Graduate Preferences'!A602,\"\")","v":""},{"$f":"IF(A601<=NGrad,Process!A601,\"\")","v":""},{"$f":"IF(A601<=NGrad,COUNTIFS('Graduate Preferences'!B602:ZZ602,C601),\"\")","v":""},{"$f":"IF(A601<=NGrad,IF(D601=0,0,MATCH(C601,'Graduate Preferences'!B602:ZZ602,0)),\"\")","v":""},"","","",null,null,null,""]
[599,{"$f":"IF(A602<=NGrad,'Graduate Preferences'!A603,\"\")","v":""},{"$f":"IF(A602<=NGrad,Process!A602,\"\")","v":""},{"$f":"IF(A602<=NGrad,COUNTIFS('Graduate Preferences'!B603:ZZ603,C602),\"\")","v":""},{"$f":"IF(A602<=NGrad,IF(D602=0,0,MATCH(C602,'Graduate Preferences'!B603:ZZ603,0)),\"\")","v":""},"","","",null,null,null,""]
[600,{"$f":"IF(A603<=NGrad,'Graduate Preferences'!A604,\"\")","v":""},{"$f":"IF(A603<=NGrad,Process!A603,\"\")","v":""},{"$f":"IF(A603<=NGrad,COUNTIFS('Graduate Preferences'!B604:ZZ604,C603),\"\")","v":""},{"$f":"IF(A603<=NGrad,IF(D603=0,0,MATCH(C603,'Graduate Preferences'!B604:ZZ604,0)),\"\")","v":""},"","","",null,null,null,""]
[601,{"$f":"IF(A604<=NGrad,'Graduate Preferences'!A605,\"\")","v":""},{"$f":"IF(A604<=NGrad,Process!A604,\"\")","v":""},{"$f":"IF(A604<=NGrad,COUNTIFS('Graduate Preferences'!B605:ZZ605,C604),\"\")","v":""},{"$f":"IF(A604<=NGrad,IF(D604=0,0,MATCH(C604,'Graduate Preferences'!B605:ZZ605,0)),\"\")","v":""},"","","",null,null,null,""]
[602,{"$f":"IF(A605<=NGrad,'Graduate Preferences'!A606,\"\")","v":""},{"$f":"IF(A605<=NGrad,Process!A605,\"\")","v":""},{"$f":"IF(A605<=NGrad,COUNTIFS('Graduate Preferences'!B606:ZZ606,C605),\"\")","v":""},{"$f":"IF(A605<=NGrad,IF(D605=0,0,MATCH(C605,'Graduate Preferences'!B606:ZZ606,0)),\"\")","v":""},"","","",null,null,null,""]
[603,{"$f":"IF(A606<=NGrad,'Graduate Preferences'!A607,\"\")","v":""},{"$f":"IF(A606<=NGrad,Process!A606,\"\")","v":""},{"$f":"IF(A606<=NGrad,COUNTIFS('Graduate Preferences'!B607:ZZ607,C606),\"\")","v":""},{"$f":"IF(A606<=NGrad,IF(D606=0,0,MATCH(C606,'Graduate Preferences'!B607:ZZ607,0)),\"\")","v":""},"","","",null,null,null,""]
[604,{"$f":"IF(A607<=NGrad,'Graduate Preferences'!A608,\"\")","v":""},{"$f":"IF(A607<=NGrad,Process!A607,\"\")","v":""},{"$f":"IF(A607<=NGrad,COUNTIFS('Graduate Preferences'!B608:ZZ608,C607),\"\")","v":""},{"$f":"IF(A607<=NGrad,IF(D607=0,0,MATCH(C607,'Graduate Preferences'!B608:ZZ608,0)),\"\")","v":""},"","","",null,null,null,""]
[605,{"$f":"IF(A608<=NGrad,'Graduate Preferences'!A609,\"\")","v":""},{"$f":"IF(A608<=NGrad,Process!A608,\"\")","v":""},{"$f":"IF(A608<=NGrad,COUNTIFS('Graduate Preferences'!B609:ZZ609,C608),\"\")","v":""},{"$f":"IF(A608<=NGrad,IF(D608=0,0,MATCH(C608,'Graduate Preferences'!B609:ZZ609,0)),\"\")","v":""},"","","",null,null,null,""]
[606,{"$f":"IF(A609<=NGrad,'Graduate Preferences'!A610,\"\")","v":""},{"$f":"IF(A609<=NGrad,Process!A609,\"\")","v":""},{"$f":"IF(A609<=NGrad,COUNTIFS('Graduate Preferences'!B610:ZZ610,C609),\"\")","v":""},{"$f":"IF(A609<=NGrad,IF(D609=0,0,MATCH(C609,'Graduate Preferences'!B610:ZZ610,0)),\"\")","v":""},"","","",null,null,null,""]
[607,{"$f":"IF(A610<=NGrad,'Graduate Preferences'!A611,\"\")","v":""},{"$f":"IF(A610<=NGrad,Process!A610,\"\")","v":""},{"$f":"IF(A610<=NGrad,COUNTIFS('Graduate Preferences'!B611:ZZ611,C610),\"\")","v":""},{"$f":"IF(A610<=NGrad,IF(D610=0,0,MATCH(C610,'Graduate Preferences'!B611:ZZ611,0)),\"\")","v":""},"","","",null,null,null,""]
[608,{"$f":"IF(A611<=NGrad,'Graduate Preferences'!A612,\"\")","v":""},{"$f":"IF(A611<=NGrad,Process!A611,\"\")","v":""},{"$f":"IF(A611<=NGrad,COUNTIFS('Graduate Preferences'!B612:ZZ612,C611),\"\")","v":""},{"$f":"IF(A611<=NGrad,IF(D611=0,0,MATCH(C611,'Graduate Preferences'!B612:ZZ612,0)),\"\")","v":""},"","","",null,null,null,""]
[609,{"$f":"IF(A612<=NGrad,'Graduate Preferences'!A613,\"\")","v":""},{"$f":"IF(A612<=NGrad,Process!A612,\"\")","v":""},{"$f":"IF(A612<=NGrad,COUNTIFS('Graduate Preferences'!B613:ZZ613,C612),\"\")","v":""},{"$f":"IF(A612<=NGrad,IF(D612=0,0,MATCH(C612,'Graduate Preferences'!B613:ZZ613,0)),\"\")","v":""},"","","",null,null,null,""]
[610,{"$f":"IF(A613<=NGrad,'Graduate Preferences'!A614,\"\")","v":""},{"$f":"IF(A613<=NGrad,Process!A613,\"\")","v":""},{"$f":"IF(A613<=NGrad,COUNTIFS('Graduate Preferences'!B614:ZZ614,C613),\"\")","v":""},{"$f":"IF(A613<=NGrad,IF(D613=0,0,MATCH(C613,'Graduate Preferences'!B614:ZZ614,0)),\"\")","v":""},"","","",null,null,null,""]
[611,{"$f":"IF(A614<=NGrad,'Graduate Preferences'!A615,\"\")","v":""},{"$f":"IF(A614<=NGrad,Process!A614,\"\")","v":""},{"$f":"IF(A614<=NGrad,COUNTIFS('Graduate Preferences'!B615:ZZ615,C614),\"\")","v":""},{"$f":"IF(A614<=NGrad,IF(D614=0,0,MATCH(C614,'Graduate Preferences'!B615:ZZ615,0)),\"\")","v":""},"","","",null,null,null,""]
[612,{"$f":"IF(A615<=NGrad,'Graduate Preferences'!A616,\"\")","v":""},{"$f":"IF(A615<=NGrad,Process!A615,\"\")","v":""},{"$f":"IF(A615<=NGrad,COUNTIFS('Graduate Preferences'!B616:ZZ616,C615),\"\")","v":""},{"$f":"IF(A615<=NGrad,IF(D615=0,0,MATCH(C615,'Graduate Preferences'!B616:ZZ616,0)),\"\")","v":""},"","","",null,null,null,""]
[613,{"$f":"IF(A616<=NGrad,'Graduate Preferences'!A617,\"\")","v":""},{"$f":"IF(A616<=NGrad,Process!A616,\"\")","v":""},{"$f":"IF(A616<=NGrad,COUNTIFS('Graduate Preferences'!B617:ZZ617,C616),\"\")","v":""},{"$f":"IF(A616<=NGrad,IF(D616=0,0,MATCH(C616,'Graduate Preferences'!B617:ZZ617,0)),\"\")","v":""},"","","",null,null,null,""]
[614,{"$f":"IF(A617<=NGrad,'Graduate Preferences'!A618,\"\")","v":""},{"$f":"IF(A617<=NGrad,Process!A617,\"\")","v":""},{"$f":"IF(A617<=NGrad,COUNTIFS('Graduate Preferences'!B618:ZZ618,C617),\"\")","v":""},{"$f":"IF(A617<=NGrad,IF(D617=0,0,MATCH(C617,'Graduate Preferences'!B618:ZZ618,0)),\"\")","v":""},"","","",null,null,null,""]
[615,{"$f":"IF(A618<=NGrad,'Graduate Preferences'!A619,\"\")","v":""},{"$f":"IF(A618<=NGrad,Process!A618,\"\")","v":""},{"$f":"IF(A618<=NGrad,COUNTIFS('Graduate Preferences'!B619:ZZ619,C618),\"\")","v":""},{"$f":"IF(A618<=NGrad,IF(D618=0,0,MATCH(C618,'Graduate Preferences'!B619:ZZ619,0)),\"\")","v":""},"","","",null,null,null,""]
[616,{"$f":"IF(A619<=NGrad,'Graduate Preferences'!A620,\"\")","v":""},{"$f":"IF(A619<=NGrad,Process!A619,\"\")","v":""},{"$f":"IF(A619<=NGrad,COUNTIFS('Graduate Preferences'!B620:ZZ620,C619),\"\")","v":""},{"$f":"IF(A619<=NGrad,IF(D619=0,0,MATCH(C619,'Graduate Preferences'!B620:ZZ620,0)),\"\")","v":""},"","","",null,null,null,""]
[617,{"$f":"IF(A620<=NGrad,'Graduate Preferences'!A621,\"\")","v":""},{"$f":"IF(A620<=NGrad,Process!A620,\"\")","v":""},{"$f":"IF(A620<=NGrad,COUNTIFS('Graduate Preferences'!B621:ZZ621,C620),\"\")","v":""},{"$f":"IF(A620<=NGrad,IF(D620=0,0,MATCH(C620,'Graduate Preferences'!B621:ZZ621,0)),\"\")","v":""},"","","",null,null,null,""]
[618,{"$f":"IF(A621<=NGrad,'Graduate Preferences'!A622,\"\")","v":""},{"$f":"IF(A621<=NGrad,Process!A621,\"\")","v":""},{"$f":"IF(A621<=NGrad,COUNTIFS('Graduate Preferences'!B622:ZZ622,C621),\"\")","v":""},{"$f":"IF(A621<=NGrad,IF(D621=0,0,MATCH(C621,'Graduate Preferences'!B622:ZZ622,0)),\"\")","v":""},"","","",null,null,null,""]
[619,{"$f":"IF(A622<=NGrad,'Graduate Preferences'!A623,\"\")","v":""},{"$f":"IF(A622<=NGrad,Process!A622,\"\")","v":""},{"$f":"IF(A622<=NGrad,COUNTIFS('Graduate Preferences'!B623:ZZ623,C622),\"\")","v":""},{"$f":"IF(A622<=NGrad,IF(D622=0,0,MATCH(C622,'Graduate Preferences'!B623:ZZ623,0)),\"\")","v":""},"","","",null,null,null,""]
[620,{"$f":"IF(A623<=NGrad,'Graduate Preferences'!A624,\"\")","v":""},{"$f":"IF(A623<=NGrad,Process!A623,\"\")","v":""},{"$f":"IF(A623<=NGrad,COUNTIFS('Graduate Preferences'!B624:ZZ624,C623),\"\")","v":""},{"$f":"IF(A623<=NGrad,IF(D623=0,0,MATCH(C623,'Graduate Preferences'!B624:ZZ624,0)),\"\")","v":""},"","","",null,null,null,""]
[621,{"$f":"IF(A624<=NGrad,'Graduate Preferences'!A625,\"\")","v":""},{"$f":"IF(A624<=NGrad,Process!A624,\"\")","v":""},{"$f":"IF(A624<=NGrad,COUNTIFS('Graduate Preferences'!B625:ZZ625,C624),\"\")","v":""},{"$f":"IF(A624<=NGrad,IF(D624=0,0,MATCH(C624,'Graduate Preferences'!B625:ZZ625,0)),\"\")","v":""},"","","",null,null,null,""]
[622,{"$f":"IF(A625<=NGrad,'Graduate Preferences'!A626,\"\")","v":""},{"$f":"IF(A625<=NGrad,Process!A625,\"\")","v":""},{"$f":"IF(A625<=NGrad,COUNTIFS('Graduate Preferences'!B626:ZZ626,C625),\"\")","v":""},{"$f":"IF(A625<=NGrad,IF(D625=0,0,MATCH(C625,'Graduate Preferences'!B626:ZZ626,0)),\"\")","v":""},"","","",null,null,null,""]
[623,{"$f":"IF(A626<=NGrad,'Graduate Preferences'!A627,\"\")","v":""},{"$f":"IF(A626<=NGrad,Process!A626,\"\")","v":""},{"$f":"IF(A626<=NGrad,COUNTIFS('Graduate Preferences'!B627:ZZ627,C626),\"\")","v":""},{"$f":"IF(A626<=NGrad,IF(D626=0,0,MATCH(C626,'Graduate Preferences'!B627:ZZ627,0)),\"\")","v":""},"","","",null,null,null,""]
[624,{"$f":"IF(A627<=NGrad,'Graduate Preferences'!A628,\"\")","v":""},{"$f":"IF(A627<=NGrad,Process!A627,\"\")","v":""},{"$f":"IF(A627<=NGrad,COUNTIFS('Graduate Preferences'!B628:ZZ628,C627),\"\")","v":""},{"$f":"IF(A627<=NGrad,IF(D627=0,0,MATCH(C627,'Graduate Preferences'!B628:ZZ628,0)),\"\")","v":""},"","","",null,null,null,""]
[625,{"$f":"IF(A628<=NGrad,'Graduate Preferences'!A629,\"\")","v":""},{"$f":"IF(A628<=NGrad,Process!A628,\"\")","v":""},{"$f":"IF(A628<=NGrad,COUNTIFS('Graduate Preferences'!B629:ZZ629,C628),\"\")","v":""},{"$f":"IF(A628<=NGrad,IF(D628=0,0,MATCH(C628,'Graduate Preferences'!B629:ZZ629,0)),\"\")","v":""},"","","",null,null,null,""]
[626,{"$f":"IF(A629<=NGrad,'Graduate Preferences'!A630,\"\")","v":""},{"$f":"IF(A629<=NGrad,Process!A629,\"\")","v":""},{"$f":"IF(A629<=NGrad,COUNTIFS('Graduate Preferences'!B630:ZZ630,C629),\"\")","v":""},{"$f":"IF(A629<=NGrad,IF(D629=0,0,MATCH(C629,'Graduate Preferences'!B630:ZZ630,0)),\"\")","v":""},"","","",null,null,null,""]
[627,{"$f":"IF(A630<=NGrad,'Graduate Preferences'!A631,\"\")","v":""},{"$f":"IF(A630<=NGrad,Process!A630,\"\")","v":""},{"$f":"IF(A630<=NGrad,COUNTIFS('Graduate Preferences'!B631:ZZ631,C630),\"\")","v":""},{"$f":"IF(A630<=NGrad,IF(D630=0,0,MATCH(C630,'Graduate Preferences'!B631:ZZ631,0)),\"\")","v":""},"","","",null,null,null,""]
[628,{"$f":"IF(A631<=NGrad,'Graduate Preferences'!A632,\"\")","v":""},{"$f":"IF(A631<=NGrad,Process!A631,\"\")","v":""},{"$f":"IF(A631<=NGrad,COUNTIFS('Graduate Preferences'!B632:ZZ632,C631),\"\")","v":""},{"$f":"IF(A631<=NGrad,IF(D631=0,0,MATCH(C631,'Graduate Preferences'!B632:ZZ632,0)),\"\")","v":""},"","","",null,null,null,""]
[629,{"$f":"IF(A632<=NGrad,'Graduate Preferences'!A633,\"\")","v":""},{"$f":"IF(A632<=NGrad,Process!A632,\"\")","v":""},{"$f":"IF(A632<=NGrad,COUNTIFS('Graduate Preferences'!B633:ZZ633,C632),\"\")","v":""},{"$f":"IF(A632<=NGrad,IF(D632=0,0,MATCH(C632,'Graduate Preferences'!B633:ZZ633,0)),\"\")","v":""},"","","",null,null,null,""]
[630,{"$f":"IF(A633<=NGrad,'Graduate Preferences'!A634,\"\")","v":""},{"$f":"IF(A633<=NGrad,Process!A633,\"\")","v":""},{"$f":"IF(A633<=NGrad,COUNTIFS('Graduate Preferences'!B634:ZZ634,C633),\"\")","v":""},{"$f":"IF(A633<=NGrad,IF(D633=0,0,MATCH(C633,'Graduate Preferences'!B634:ZZ634,0)),\"\")","v":""},"","","",null,null,null,""]
[631,{"$f":"IF(A634<=NGrad,'Graduate Preferences'!A635,\"\")","v":""},{"$f":"IF(A634<=NGrad,Process!A634,\"\")","v":""},{"$f":"IF(A634<=NGrad,COUNTIFS('Graduate Preferences'!B635:ZZ635,C634),\"\")","v":""},{"$f":"IF(A634<=NGrad,IF(D634=0,0,MATCH(C634,'Graduate Preferences'!B635:ZZ635,0)),\"\")","v":""},"","","",null,null,null,""]
[632,{"$f":"IF(A635<=NGrad,'Graduate Preferences'!A636,\"\")","v":""},{"$f":"IF(A635<=NGrad,Process!A635,\"\")","v":""},{"$f":"IF(A635<=NGrad,COUNTIFS('Graduate Preferences'!B636:ZZ636,C635),\"\")","v":""},{"$f":"IF(A635<=NGrad,IF(D635=0,0,MATCH(C635,'Graduate Preferences'!B636:ZZ636,0)),\"\")","v":""},"","","",null,null,null,""]
[633,{"$f":"IF(A636<=NGrad,'Graduate Preferences'!A637,\"\")","v":""},{"$f":"IF(A636<=NGrad,Process!A636,\"\")","v":""},{"$f":"IF(A636<=NGrad,COUNTIFS('Graduate Preferences'!B637:ZZ637,C636),\"\")","v":""},{"$f":"IF(A636<=NGrad,IF(D636=0,0,MATCH(C636,'Graduate Preferences'!B637:ZZ637,0)),\"\")","v":""},"","","",null,null,null,""]
[634,{"$f":"IF(A637<=NGrad,'Graduate Preferences'!A638,\"\")","v":""},{"$f":"IF(A637<=NGrad,Process!A637,\"\")","v":""},{"$f":"IF(A637<=NGrad,COUNTIFS('Graduate Preferences'!B638:ZZ638,C637),\"\")","v":""},{"$f":"IF(A637<=NGrad,IF(D637=0,0,MATCH(C637,'Graduate Preferences'!B638:ZZ638,0)),\"\")","v":""},"","","",null,null,null,""]
[635,{"$f":"IF(A638<=NGrad,'Graduate Preferences'!A639,\"\")","v":""},{"$f":"IF(A638<=NGrad,Process!A638,\"\")","v":""},{"$f":"IF(A638<=NGrad,COUNTIFS('Graduate Preferences'!B639:ZZ639,C638),\"\")","v":""},{"$f":"IF(A638<=NGrad,IF(D638=0,0,MATCH(C638,'Graduate Preferences'!B639:ZZ639,0)),\"\")","v":""},"","","",null,null,null,""]
[636,{"$f":"IF(A639<=NGrad,'Graduate Preferences'!A640,\"\")","v":""},{"$f":"IF(A639<=NGrad,Process!A639,\"\")","v":""},{"$f":"IF(A639<=NGrad,COUNTIFS('Graduate Preferences'!B640:ZZ640,C639),\"\")","v":""},{"$f":"IF(A639<=NGrad,IF(D639=0,0,MATCH(C639,'Graduate Preferences'!B640:ZZ640,0)),\"\")","v":""},"","","",null,null,null,""]
[637,{"$f":"IF(A640<=NGrad,'Graduate Preferences'!A641,\"\")","v":""},{"$f":"IF(A640<=NGrad,Process!A640,\"\")","v":""},{"$f":"IF(A640<=NGrad,COUNTIFS('Graduate Preferences'!B641:ZZ641,C640),\"\")","v":""},{"$f":"IF(A640<=NGrad,IF(D640=0,0,MATCH(C640,'Graduate Preferences'!B641:ZZ641,0)),\"\")","v":""},"","","",null,null,null,""]
[638,{"$f":"IF(A641<=NGrad,'Graduate Preferences'!A642,\"\")","v":""},{"$f":"IF(A641<=NGrad,Process!A641,\"\")","v":""},{"$f":"IF(A641<=NGrad,COUNTIFS('Graduate Preferences'!B642:ZZ642,C641),\"\")","v":""},{"$f":"IF(A641<=NGrad,IF(D641=0,0,MATCH(C641,'Graduate Preferences'!B642:ZZ642,0)),\"\")","v":""},"","","",null,null,null,""]
[639,{"$f":"IF(A642<=NGrad,'Graduate Preferences'!A643,\"\")","v":""},{"$f":"IF(A642<=NGrad,Process!A642,\"\")","v":""},{"$f":"IF(A642<=NGrad,COUNTIFS('Graduate Preferences'!B643:ZZ643,C642),\"\")","v":""},{"$f":"IF(A642<=NGrad,IF(D642=0,0,MATCH(C642,'Graduate Preferences'!B643:ZZ643,0)),\"\")","v":""},"","","",null,null,null,""]
[640,{"$f":"IF(A643<=NGrad,'Graduate Preferences'!A644,\"\")","v":""},{"$f":"IF(A643<=NGrad,Process!A643,\"\")","v":""},{"$f":"IF(A643<=NGrad,COUNTIFS('Graduate Preferences'!B644:ZZ644,C643),\"\")","v":""},{"$f":"IF(A643<=NGrad,IF(D643=0,0,MATCH(C643,'Graduate Preferences'!B644:ZZ644,0)),\"\")","v":""},"","","",null,null,null,""]
[641,{"$f":"IF(A644<=NGrad,'Graduate Preferences'!A645,\"\")","v":""},{"$f":"IF(A644<=NGrad,Process!A644,\"\")","v":""},{"$f":"IF(A644<=NGrad,COUNTIFS('Graduate Preferences'!B645:ZZ645,C644),\"\")","v":""},{"$f":"IF(A644<=NGrad,IF(D644=0,0,MATCH(C644,'Graduate Preferences'!B645:ZZ645,0)),\"\")","v":""},"","","",null,null,null,""]
[642,{"$f":"IF(A645<=NGrad,'Graduate Preferences'!A646,\"\")","v":""},{"$f":"IF(A645<=NGrad,Process!A645,\"\")","v":""},{"$f":"IF(A645<=NGrad,COUNTIFS('Graduate Preferences'!B646:ZZ646,C645),\"\")","v":""},{"$f":"IF(A645<=NGrad,IF(D645=0,0,MATCH(C645,'Graduate Preferences'!B646:ZZ646,0)),\"\")","v":""},"",{"$f":"IF(F645=\"\",\"\",RANK(F645,F$4:F$1000))","v":""},"",null,null,null,{"$f":"IF(MAX(H$4:H$1000)>=A645,MATCH(A645,H$4:H$1000,0),\"\")","v":""}]
[643,{"$f":"IF(A646<=NGrad,'Graduate Preferences'!A647,\"\")","v":""},{"$f":"IF(A646<=NGrad,Process!A646,\"\")","v":""},{"$f":"IF(A646<=NGrad,COUNTIFS('Graduate Preferences'!B647:ZZ647,C646),\"\")","v":""},{"$f":"IF(A646<=NGrad,IF(D646=0,0,MATCH(C646,'Graduate Preferences'!B647:ZZ647,0)),\"\")","v":""},{"$f":"IF(AND(J646<>\"-\",J646>0,I646=F$2),J646,\"\")","v":""},"",{"$f":"IF(F646=\"\",\"\",MAX(G$4:G$1000)-G646+1)","v":""},null,null,null,""]
[644,{"$f":"IF(A647<=NGrad,'Graduate Preferences'!A648,\"\")","v":""},{"$f":"IF(A647<=NGrad,Process!A647,\"\")","v":""},{"$f":"IF(A647<=NGrad,COUNTIFS('Graduate Preferences'!B648:ZZ648,C647),\"\")","v":""},{"$f":"IF(A647<=NGrad,IF(D647=0,0,MATCH(C647,'Graduate Preferences'!B648:ZZ648,0)),\"\")","v":""},"","","",null,null,null,""]
[645,{"$f":"IF(A648<=NGrad,'Graduate Preferences'!A649,\"\")","v":""},{"$f":"IF(A648<=NGrad,Process!A648,\"\")","v":""},{"$f":"IF(A648<=NGrad,COUNTIFS('Graduate Preferences'!B649:ZZ649,C648),\"\")","v":""},{"$f":"IF(A648<=NGrad,IF(D648=0,0,MATCH(C648,'Graduate Preferences'!B649:ZZ649,0)),\"\")","v":""},"","","",null,null,null,""]
[646,{"$f":"IF(A649<=NGrad,'Graduate Preferences'!A650,\"\")","v":""},{"$f":"IF(A649<=NGrad,Process!A649,\"\")","v":""},{"$f":"IF(A649<=NGrad,COUNTIFS('Graduate Preferences'!B650:ZZ650,C649),\"\")","v":""},{"$f":"IF(A649<=NGrad,IF(D649=0,0,MATCH(C649,'Graduate Preferences'!B650:ZZ650,0)),\"\")","v":""},"","","",null,null,null,""]
[647,{"$f":"IF(A650<=NGrad,'Graduate Preferences'!A651,\"\")","v":""},{"$f":"IF(A650<=NGrad,Process!A650,\"\")","v":""},{"$f":"IF(A650<=NGrad,COUNTIFS('Graduate Preferences'!B651:ZZ651,C650),\"\")","v":""},{"$f":"IF(A650<=NGrad,IF(D650=0,0,MATCH(C650,'Graduate Preferences'!B651:ZZ651,0)),\"\")","v":""},"","","",null,null,null,""]
[648,{"$f":"IF(A651<=NGrad,'Graduate Preferences'!A652,\"\")","v":""},{"$f":"IF(A651<=NGrad,Process!A651,\"\")","v":""},{"$f":"IF(A651<=NGrad,COUNTIFS('Graduate Preferences'!B652:ZZ652,C651),\"\")","v":""},{"$f":"IF(A651<=NGrad,IF(D651=0,0,MATCH(C651,'Graduate Preferences'!B652:ZZ652,0)),\"\")","v":""},"","","",null,null,null,""]
[649,{"$f":"IF(A652<=NGrad,'Graduate Preferences'!A653,\"\")","v":""},{"$f":"IF(A652<=NGrad,Process!A652,\"\")","v":""},{"$f":"IF(A652<=NGrad,COUNTIFS('Graduate Preferences'!B653:ZZ653,C652),\"\")","v":""},{"$f":"IF(A652<=NGrad,IF(D652=0,0,MATCH(C652,'Graduate Preferences'!B653:ZZ653,0)),\"\")","v":""},"","","",null,null,null,""]
[650,{"$f":"IF(A653<=NGrad,'Graduate Preferences'!A654,\"\")","v":""},{"$f":"IF(A653<=NGrad,Process!A653,\"\")","v":""},{"$f":"IF(A653<=NGrad,COUNTIFS('Graduate Preferences'!B654:ZZ654,C653),\"\")","v":""},{"$f":"IF(A653<=NGrad,IF(D653=0,0,MATCH(C653,'Graduate Preferences'!B654:ZZ654,0)),\"\")","v":""},"","","",null,null,null,""]
[651,{"$f":"IF(A654<=NGrad,'Graduate Preferences'!A655,\"\")","v":""},{"$f":"IF(A654<=NGrad,Process!A654,\"\")","v":""},{"$f":"IF(A654<=NGrad,COUNTIFS('Graduate Preferences'!B655:ZZ655,C654),\"\")","v":""},{"$f":"IF(A654<=NGrad,IF(D654=0,0,MATCH(C654,'Graduate Preferences'!B655:ZZ655,0)),\"\")","v":""},"","","",null,null,null,""]
[652,{"$f":"IF(A655<=NGrad,'Graduate Preferences'!A656,\"\")","v":""},{"$f":"IF(A655<=NGrad,Process!A655,\"\")","v":""},{"$f":"IF(A655<=NGrad,COUNTIFS('Graduate Preferences'!B656:ZZ656,C655),\"\")","v":""},{"$f":"IF(A655<=NGrad,IF(D655=0,0,MATCH(C655,'Graduate Preferences'!B656:ZZ656,0)),\"\")","v":""},"","","",null,null,null,""]
[653,{"$f":"IF(A656<=NGrad,'Graduate Preferences'!A657,\"\")","v":""},{"$f":"IF(A656<=NGrad,Process!A656,\"\")","v":""},{"$f":"IF(A656<=NGrad,COUNTIFS('Graduate Preferences'!B657:ZZ657,C656),\"\")","v":""},{"$f":"IF(A656<=NGrad,IF(D656=0,0,MATCH(C656,'Graduate Preferences'!B657:ZZ657,0)),\"\")","v":""},"","","",null,null,null,""]
[654,{"$f":"IF(A657<=NGrad,'Graduate Preferences'!A658,\"\")","v":""},{"$f":"IF(A657<=NGrad,Process!A657,\"\")","v":""},{"$f":"IF(A657<=NGrad,COUNTIFS('Graduate Preferences'!B658:ZZ658,C657),\"\")","v":""},{"$f":"IF(A657<=NGrad,IF(D657=0,0,MATCH(C657,'Graduate Preferences'!B658:ZZ658,0)),\"\")","v":""},"","","",null,null,null,""]
[655,{"$f":"IF(A658<=NGrad,'Graduate Preferences'!A659,\"\")","v":""},{"$f":"IF(A658<=NGrad,Process!A658,\"\")","v":""},{"$f":"IF(A658<=NGrad,COUNTIFS('Graduate Preferences'!B659:ZZ659,C658),\"\")","v":""},{"$f":"IF(A658<=NGrad,IF(D658=0,0,MATCH(C658,'Graduate Preferences'!B659:ZZ659,0)),\"\")","v":""},"","","",null,null,null,""]
[656,{"$f":"IF(A659<=NGrad,'Graduate Preferences'!A660,\"\")","v":""},{"$f":"IF(A659<=NGrad,Process!A659,\"\")","v":""},{"$f":"IF(A659<=NGrad,COUNTIFS('Graduate Preferences'!B660:ZZ660,C659),\"\")","v":""},{"$f":"IF(A659<=NGrad,IF(D659=0,0,MATCH(C659,'Graduate Preferences'!B660:ZZ660,0)),\"\")","v":""},"","","",null,null,null,""]
[657,{"$f":"IF(A660<=NGrad,'Graduate Preferences'!A661,\"\")","v":""},{"$f":"IF(A660<=NGrad,Process!A660,\"\")","v":""},{"$f":"IF(A660<=NGrad,COUNTIFS('Graduate Preferences'!B661:ZZ661,C660),\"\")","v":""},{"$f":"IF(A660<=NGrad,IF(D660=0,0,MATCH(C660,'Graduate Preferences'!B661:ZZ661,0)),\"\")","v":""},"","","",null,null,null,""]
[658,{"$f":"IF(A661<=NGrad,'Graduate Preferences'!A662,\"\")","v":""},{"$f":"IF(A661<=NGrad,Process!A661,\"\")","v":""},{"$f":"IF(A661<=NGrad,COUNTIFS('Graduate Preferences'!B662:ZZ662,C661),\"\")","v":""},{"$f":"IF(A661<=NGrad,IF(D661=0,0,MATCH(C661,'Graduate Preferences'!B662:ZZ662,0)),\"\")","v":""},"","","",null,null,null,""]
[659,{"$f":"IF(A662<=NGrad,'Graduate Preferences'!A663,\"\")","v":""},{"$f":"IF(A662<=NGrad,Process!A662,\"\")","v":""},{"$f":"IF(A662<=NGrad,COUNTIFS('Graduate Preferences'!B663:ZZ663,C662),\"\")","v":""},{"$f":"IF(A662<=NGrad,IF(D662=0,0,MATCH(C662,'Graduate Preferences'!B663:ZZ663,0)),\"\")","v":""},"","","",null,null,null,""]
[660,{"$f":"IF(A663<=NGrad,'Graduate Preferences'!A664,\"\")","v":""},{"$f":"IF(A663<=NGrad,Process!A663,\"\")","v":""},{"$f":"IF(A663<=NGrad,COUNTIFS('Graduate Preferences'!B664:ZZ664,C663),\"\")","v":""},{"$f":"IF(A663<=NGrad,IF(D663=0,0,MATCH(C663,'Graduate Preferences'!B664:ZZ664,0)),\"\")","v":""},"","","",null,null,null,""]
[661,{"$f":"IF(A664<=NGrad,'Graduate Preferences'!A665,\"\")","v":""},{"$f":"IF(A664<=NGrad,Process!A664,\"\")","v":""},{"$f":"IF(A664<=NGrad,COUNTIFS('Graduate Preferences'!B665:ZZ665,C664),\"\")","v":""},{"$f":"IF(A664<=NGrad,IF(D664=0,0,MATCH(C664,'Graduate Preferences'!B665:ZZ665,0)),\"\")","v":""},"","","",null,null,null,""]
[662,{"$f":"IF(A665<=NGrad,'Graduate Preferences'!A666,\"\")","v":""},{"$f":"IF(A665<=NGrad,Process!A665,\"\")","v":""},{"$f":"IF(A665<=NGrad,COUNTIFS('Graduate Preferences'!B666:ZZ666,C665),\"\")","v":""},{"$f":"IF(A665<=NGrad,IF(D665=0,0,MATCH(C665,'Graduate Preferences'!B666:ZZ666,0)),\"\")","v":""},"","","",null,null,null,""]
[663,{"$f":"IF(A666<=NGrad,'Graduate Preferences'!A667,\"\")","v":""},{"$f":"IF(A666<=NGrad,Process!A666,\"\")","v":""},{"$f":"IF(A666<=NGrad,COUNTIFS('Graduate Preferences'!B667:ZZ667,C666),\"\")","v":""},{"$f":"IF(A666<=NGrad,IF(D666=0,0,MATCH(C666,'Graduate Preferences'!B667:ZZ667,0)),\"\")","v":""},"","","",null,null,null,""]
[664,{"$f":"IF(A667<=NGrad,'Graduate Preferences'!A668,\"\")","v":""},{"$f":"IF(A667<=NGrad,Process!A667,\"\")","v":""},{"$f":"IF(A667<=NGrad,COUNTIFS('Graduate Preferences'!B668:ZZ668,C667),\"\")","v":""},{"$f":"IF(A667<=NGrad,IF(D667=0,0,MATCH(C667,'Graduate Preferences'!B668:ZZ668,0)),\"\")","v":""},"","","",null,null,null,""]
[665,{"$f":"IF(A668<=NGrad,'Graduate Preferences'!A669,\"\")","v":""},{"$f":"IF(A668<=NGrad,Process!A668,\"\")","v":""},{"$f":"IF(A668<=NGrad,COUNTIFS('Graduate Preferences'!B669:ZZ669,C668),\"\")","v":""},{"$f":"IF(A668<=NGrad,IF(D668=0,0,MATCH(C668,'Graduate Preferences'!B669:ZZ669,0)),\"\")","v":""},"","","",null,null,null,""]
[666,{"$f":"IF(A669<=NGrad,'Graduate Preferences'!A670,\"\")","v":""},{"$f":"IF(A669<=NGrad,Process!A669,\"\")","v":""},{"$f":"IF(A669<=NGrad,COUNTIFS('Graduate Preferences'!B670:ZZ670,C669),\"\")","v":""},{"$f":"IF(A669<=NGrad,IF(D669=0,0,MATCH(C669,'Graduate Preferences'!B670:ZZ670,0)),\"\")","v":""},"","","",null,null,null,""]
[667,{"$f":"IF(A670<=NGrad,'Graduate Preferences'!A671,\"\")","v":""},{"$f":"IF(A670<=NGrad,Process!A670,\"\")","v":""},{"$f":"IF(A670<=NGrad,COUNTIFS('Graduate Preferences'!B671:ZZ671,C670),\"\")","v":""},{"$f":"IF(A670<=NGrad,IF(D670=0,0,MATCH(C670,'Graduate Preferences'!B671:ZZ671,0)),\"\")","v":""},"","","",null,null,null,""]
[668,{"$f":"IF(A671<=NGrad,'Graduate Preferences'!A672,\"\")","v":""},{"$f":"IF(A671<=NGrad,Process!A671,\"\")","v":""},{"$f":"IF(A671<=NGrad,COUNTIFS('Graduate Preferences'!B672:ZZ672,C671),\"\")","v":""},{"$f":"IF(A671<=NGrad,IF(D671=0,0,MATCH(C671,'Graduate Preferences'!B672:ZZ672,0)),\"\")","v":""},"","","",null,null,null,""]
[669,{"$f":"IF(A672<=NGrad,'Graduate Preferences'!A673,\"\")","v":""},{"$f":"IF(A672<=NGrad,Process!A672,\"\")","v":""},{"$f":"IF(A672<=NGrad,COUNTIFS('Graduate Preferences'!B673:ZZ673,C672),\"\")","v":""},{"$f":"IF(A672<=NGrad,IF(D672=0,0,MATCH(C672,'Graduate Preferences'!B673:ZZ673,0)),\"\")","v":""},"","","",null,null,null,""]
[670,{"$f":"IF(A673<=NGrad,'Graduate Preferences'!A674,\"\")","v":""},{"$f":"IF(A673<=NGrad,Process!A673,\"\")","v":""},{"$f":"IF(A673<=NGrad,COUNTIFS('Graduate Preferences'!B674:ZZ674,C673),\"\")","v":""},{"$f":"IF(A673<=NGrad,IF(D673=0,0,MATCH(C673,'Graduate Preferences'!B674:ZZ674,0)),\"\")","v":""},"","","",null,null,null,""]
[671,{"$f":"IF(A674<=NGrad,'Graduate Preferences'!A675,\"\")","v":""},{"$f":"IF(A674<=NGrad,Process!A674,\"\")","v":""},{"$f":"IF(A674<=NGrad,COUNTIFS('Graduate Preferences'!B675:ZZ675,C674),\"\")","v":""},{"$f":"IF(A674<=NGrad,IF(D674=0,0,MATCH(C674,'Graduate Preferences'!B675:ZZ675,0)),\"\")","v":""},"","","",null,null,null,""]
[672,{"$f":"IF(A675<=NGrad,'Graduate Preferences'!A676,\"\")","v":""},{"$f":"IF(A675<=NGrad,Process!A675,\"\")","v":""},{"$f":"IF(A675<=NGrad,COUNTIFS('Graduate Preferences'!B676:ZZ676,C675),\"\")","v":""},{"$f":"IF(A675<=NGrad,IF(D675=0,0,MATCH(C675,'Graduate Preferences'!B676:ZZ676,0)),\"\")","v":""},"","","",null,null,null,""]
[673,{"$f":"IF(A676<=NGrad,'Graduate Preferences'!A677,\"\")","v":""},{"$f":"IF(A676<=NGrad,Process!A676,\"\")","v":""},{"$f":"IF(A676<=NGrad,COUNTIFS('Graduate Preferences'!B677:ZZ677,C676),\"\")","v":""},{"$f":"IF(A676<=NGrad,IF(D676=0,0,MATCH(C676,'Graduate Preferences'!B677:ZZ677,0)),\"\")","v":""},"","","",null,null,null,""]
[674,{"$f":"IF(A677<=NGrad,'Graduate Preferences'!A678,\"\")","v":""},{"$f":"IF(A677<=NGrad,Process!A677,\"\")","v":""},{"$f":"IF(A677<=NGrad,COUNTIFS('Graduate Preferences'!B678:ZZ678,C677),\"\")","v":""},{"$f":"IF(A677<=NGrad,IF(D677=0,0,MATCH(C677,'Graduate Preferences'!B678:ZZ678,0)),\"\")","v":""},"","","",null,null,null,""]
[675,{"$f":"IF(A678<=NGrad,'Graduate Preferences'!A679,\"\")","v":""},{"$f":"IF(A678<=NGrad,Process!A678,\"\")","v":""},{"$f":"IF(A678<=NGrad,COUNTIFS('Graduate Preferences'!B679:ZZ679,C678),\"\")","v":""},{"$f":"IF(A678<=NGrad,IF(D678=0,0,MATCH(C678,'Graduate Preferences'!B679:ZZ679,0)),\"\")","v":""},"","","",null,null,null,""]
[676,{"$f":"IF(A679<=NGrad,'Graduate Preferences'!A680,\"\")","v":""},{"$f":"IF(A679<=NGrad,Process!A679,\"\")","v":""},{"$f":"IF(A679<=NGrad,COUNTIFS('Graduate Preferences'!B680:ZZ680,C679),\"\")","v":""},{"$f":"IF(A679<=NGrad,IF(D679=0,0,MATCH(C679,'Graduate Preferences'!B680:ZZ680,0)),\"\")","v":""},"","","",null,null,null,""]
[677,{"$f":"IF(A680<=NGrad,'Graduate Preferences'!A681,\"\")","v":""},{"$f":"IF(A680<=NGrad,Process!A680,\"\")","v":""},{"$f":"IF(A680<=NGrad,COUNTIFS('Graduate Preferences'!B681:ZZ681,C680),\"\")","v":""},{"$f":"IF(A680<=NGrad,IF(D680=0,0,MATCH(C680,'Graduate Preferences'!B681:ZZ681,0)),\"\")","v":""},"","","",null,null,null,""]
[678,{"$f":"IF(A681<=NGrad,'Graduate Preferences'!A682,\"\")","v":""},{"$f":"IF(A681<=NGrad,Process!A681,\"\")","v":""},{"$f":"IF(A681<=NGrad,COUNTIFS('Graduate Preferences'!B682:ZZ682,C681),\"\")","v":""},{"$f":"IF(A681<=NGrad,IF(D681=0,0,MATCH(C681,'Graduate Preferences'!B682:ZZ682,0)),\"\")","v":""},"","","",null,null,null,""]
[679,{"$f":"IF(A682<=NGrad,'Graduate Preferences'!A683,\"\")","v":""},{"$f":"IF(A682<=NGrad,Process!A682,\"\")","v":""},{"$f":"IF(A682<=NGrad,COUNTIFS('Graduate Preferences'!B683:ZZ683,C682),\"\")","v":""},{"$f":"IF(A682<=NGrad,IF(D682=0,0,MATCH(C682,'Graduate Preferences'!B683:ZZ683,0)),\"\")","v":""},"","","",null,null,null,""]
[680,{"$f":"IF(A683<=NGrad,'Graduate Preferences'!A684,\"\")","v":""},{"$f":"IF(A683<=NGrad,Process!A683,\"\")","v":""},{"$f":"IF(A683<=NGrad,COUNTIFS('Graduate Preferences'!B684:ZZ684,C683),\"\")","v":""},{"$f":"IF(A683<=NGrad,IF(D683=0,0,MATCH(C683,'Graduate Preferences'!B684:ZZ684,0)),\"\")","v":""},"","","",null,null,null,""]
[681,{"$f":"IF(A684<=NGrad,'Graduate Preferences'!A685,\"\")","v":""},{"$f":"IF(A684<=NGrad,Process!A684,\"\")","v":""},{"$f":"IF(A684<=NGrad,COUNTIFS('Graduate Preferences'!B685:ZZ685,C684),\"\")","v":""},{"$f":"IF(A684<=NGrad,IF(D684=0,0,MATCH(C684,'Graduate Preferences'!B685:ZZ685,0)),\"\")","v":""},"","","",null,null,null,""]
[682,{"$f":"IF(A685<=NGrad,'Graduate Preferences'!A686,\"\")","v":""},{"$f":"IF(A685<=NGrad,Process!A685,\"\")","v":""},{"$f":"IF(A685<=NGrad,COUNTIFS('Graduate Preferences'!B686:ZZ686,C685),\"\")","v":""},{"$f":"IF(A685<=NGrad,IF(D685=0,0,MATCH(C685,'Graduate Preferences'!B686:ZZ686,0)),\"\")","v":""},"","","",null,null,null,""]
[683,{"$f":"IF(A686<=NGrad,'Graduate Preferences'!A687,\"\")","v":""},{"$f":"IF(A686<=NGrad,Process!A686,\"\")","v":""},{"$f":"IF(A686<=NGrad,COUNTIFS('Graduate Preferences'!B687:ZZ687,C686),\"\")","v":""},{"$f":"IF(A686<=NGrad,IF(D686=0,0,MATCH(C686,'Graduate Preferences'!B687:ZZ687,0)),\"\")","v":""},"","","",null,null,null,""]
[684,{"$f":"IF(A687<=NGrad,'Graduate Preferences'!A688,\"\")","v":""},{"$f":"IF(A687<=NGrad,Process!A687,\"\")","v":""},{"$f":"IF(A687<=NGrad,COUNTIFS('Graduate Preferences'!B688:ZZ688,C687),\"\")","v":""},{"$f":"IF(A687<=NGrad,IF(D687=0,0,MATCH(C687,'Graduate Preferences'!B688:ZZ688,0)),\"\")","v":""},"","","",null,null,null,""]
[685,{"$f":"IF(A688<=NGrad,'Graduate Preferences'!A689,\"\")","v":""},{"$f":"IF(A688<=NGrad,Process!A688,\"\")","v":""},{"$f":"IF(A688<=NGrad,COUNTIFS('Graduate Preferences'!B689:ZZ689,C688),\"\")","v":""},{"$f":"IF(A688<=NGrad,IF(D688=0,0,MATCH(C688,'Graduate Preferences'!B689:ZZ689,0)),\"\")","v":""},"","","",null,null,null,""]
[686,{"$f":"IF(A689<=NGrad,'Graduate Preferences'!A690,\"\")","v":""},{"$f":"IF(A689<=NGrad,Process!A689,\"\")","v":""},{"$f":"IF(A689<=NGrad,COUNTIFS('Graduate Preferences'!B690:ZZ690,C689),\"\")","v":""},{"$f":"IF(A689<=NGrad,IF(D689=0,0,MATCH(C689,'Graduate Preferences'!B690:ZZ690,0)),\"\")","v":""},"","","",null,null,null,""]
[687,{"$f":"IF(A690<=NGrad,'Graduate Preferences'!A691,\"\")","v":""},{"$f":"IF(A690<=NGrad,Process!A690,\"\")","v":""},{"$f":"IF(A690<=NGrad,COUNTIFS('Graduate Preferences'!B691:ZZ691,C690),\"\")","v":""},{"$f":"IF(A690<=NGrad,IF(D690=0,0,MATCH(C690,'Graduate Preferences'!B691:ZZ691,0)),\"\")","v":""},"","","",null,null,null,""]
[688,{"$f":"IF(A691<=NGrad,'Graduate Preferences'!A692,\"\")","v":""},{"$f":"IF(A691<=NGrad,Process!A691,\"\")","v":""},{"$f":"IF(A691<=NGrad,COUNTIFS('Graduate Preferences'!B692:ZZ692,C691),\"\")","v":""},{"$f":"IF(A691<=NGrad,IF(D691=0,0,MATCH(C691,'Graduate Preferences'!B692:ZZ692,0)),\"\")","v":""},"","","",null,null,null,""]
[689,{"$f":"IF(A692<=NGrad,'Graduate Preferences'!A693,\"\")","v":""},{"$f":"IF(A692<=NGrad,Process!A692,\"\")","v":""},{"$f":"IF(A692<=NGrad,COUNTIFS('Graduate Preferences'!B693:ZZ693,C692),\"\")","v":""},{"$f":"IF(A692<=NGrad,IF(D692=0,0,MATCH(C692,'Graduate Preferences'!B693:ZZ693,0)),\"\")","v":""},"","","",null,null,null,""]
[690,{"$f":"IF(A693<=NGrad,'Graduate Preferences'!A694,\"\")","v":""},{"$f":"IF(A693<=NGrad,Process!A693,\"\")","v":""},{"$f":"IF(A693<=NGrad,COUNTIFS('Graduate Preferences'!B694:ZZ694,C693),\"\")","v":""},{"$f":"IF(A693<=NGrad,IF(D693=0,0,MATCH(C693,'Graduate Preferences'!B694:ZZ694,0)),\"\")","v":""},"","","",null,null,null,""]
[691,{"$f":"IF(A694<=NGrad,'Graduate Preferences'!A695,\"\")","v":""},{"$f":"IF(A694<=NGrad,Process!A694,\"\")","v":""},{"$f":"IF(A694<=NGrad,COUNTIFS('Graduate Preferences'!B695:ZZ695,C694),\"\")","v":""},{"$f":"IF(A694<=NGrad,IF(D694=0,0,MATCH(C694,'Graduate Preferences'!B695:ZZ695,0)),\"\")","v":""},"","","",null,null,null,""]
[692,{"$f":"IF(A695<=NGrad,'Graduate Preferences'!A696,\"\")","v":""},{"$f":"IF(A695<=NGrad,Process!A695,\"\")","v":""},{"$f":"IF(A695<=NGrad,COUNTIFS('Graduate Preferences'!B696:ZZ696,C695),\"\")","v":""},{"$f":"IF(A695<=NGrad,IF(D695=0,0,MATCH(C695,'Graduate Preferences'!B696:ZZ696,0)),\"\")","v":""},"","","",null,null,null,""]
[693,{"$f":"IF(A696<=NGrad,'Graduate Preferences'!A697,\"\")","v":""},{"$f":"IF(A696<=NGrad,Process!A696,\"\")","v":""},{"$f":"IF(A696<=NGrad,COUNTIFS('Graduate Preferences'!B697:ZZ697,C696),\"\")","v":""},{"$f":"IF(A696<=NGrad,IF(D696=0,0,MATCH(C696,'Graduate Preferences'!B697:ZZ697,0)),\"\")","v":""},"","","",null,null,null,""]
[694,{"$f":"IF(A697<=NGrad,'Graduate Preferences'!A698,\"\")","v":""},{"$f":"IF(A697<=NGrad,Process!A697,\"\")","v":""},{"$f":"IF(A697<=NGrad,COUNTIFS('Graduate Preferences'!B698:ZZ698,C697),\"\")","v":""},{"$f":"IF(A697<=NGrad,IF(D697=0,0,MATCH(C697,'Graduate Preferences'!B698:ZZ698,0)),\"\")","v":""},"","","",null,null,null,""]
[695,{"$f":"IF(A698<=NGrad,'Graduate Preferences'!A699,\"\")","v":""},{"$f":"IF(A698<=NGrad,Process!A698,\"\")","v":""},{"$f":"IF(A698<=NGrad,COUNTIFS('Graduate Preferences'!B699:ZZ699,C698),\"\")","v":""},{"$f":"IF(A698<=NGrad,IF(D698=0,0,MATCH(C698,'Graduate Preferences'!B699:ZZ699,0)),\"\")","v":""},"","","",null,null,null,""]
[696,{"$f":"IF(A699<=NGrad,'Graduate Preferences'!A700,\"\")","v":""},{"$f":"IF(A699<=NGrad,Process!A699,\"\")","v":""},{"$f":"IF(A699<=NGrad,COUNTIFS('Graduate Preferences'!B700:ZZ700,C699),\"\")","v":""},{"$f":"IF(A699<=NGrad,IF(D699=0,0,MATCH(C699,'Graduate Preferences'!B700:ZZ700,0)),\"\")","v":""},"","","",null,null,null,""]
[697,{"$f":"IF(A700<=NGrad,'Graduate Preferences'!A701,\"\")","v":""},{"$f":"IF(A700<=NGrad,Process!A700,\"\")","v":""},{"$f":"IF(A700<=NGrad,COUNTIFS('Graduate Preferences'!B701:ZZ701,C700),\"\")","v":""},{"$f":"IF(A700<=NGrad,IF(D700=0,0,MATCH(C700,'Graduate Preferences'!B701:ZZ701,0)),\"\")","v":""},"","","",null,null,null,""]
[698,{"$f":"IF(A701<=NGrad,'Graduate Preferences'!A702,\"\")","v":""},{"$f":"IF(A701<=NGrad,Process!A701,\"\")","v":""},{"$f":"IF(A701<=NGrad,COUNTIFS('Graduate Preferences'!B702:ZZ702,C701),\"\")","v":""},{"$f":"IF(A701<=NGrad,IF(D701=0,0,MATCH(C701,'Graduate Preferences'!B702:ZZ702,0)),\"\")","v":""},"","","",null,null,null,""]
[699,{"$f":"IF(A702<=NGrad,'Graduate Preferences'!A703,\"\")","v":""},{"$f":"IF(A702<=NGrad,Process!A702,\"\")","v":""},{"$f":"IF(A702<=NGrad,COUNTIFS('Graduate Preferences'!B703:ZZ703,C702),\"\")","v":""},{"$f":"IF(A702<=NGrad,IF(D702=0,0,MATCH(C702,'Graduate Preferences'!B703:ZZ703,0)),\"\")","v":""},"","","",null,null,null,""]
[700,{"$f":"IF(A703<=NGrad,'Graduate Preferences'!A704,\"\")","v":""},{"$f":"IF(A703<=NGrad,Process!A703,\"\")","v":""},{"$f":"IF(A703<=NGrad,COUNTIFS('Graduate Preferences'!B704:ZZ704,C703),\"\")","v":""},{"$f":"IF(A703<=NGrad,IF(D703=0,0,MATCH(C703,'Graduate Preferences'!B704:ZZ704,0)),\"\")","v":""},"","","",null,null,null,""]
[701,{"$f":"IF(A704<=NGrad,'Graduate Preferences'!A705,\"\")","v":""},{"$f":"IF(A704<=NGrad,Process!A704,\"\")","v":""},{"$f":"IF(A704<=NGrad,COUNTIFS('Graduate Preferences'!B705:ZZ705,C704),\"\")","v":""},{"$f":"IF(A704<=NGrad,IF(D704=0,0,MATCH(C704,'Graduate Preferences'!B705:ZZ705,0)),\"\")","v":""},"","","",null,null,null,""]
[702,{"$f":"IF(A705<=NGrad,'Graduate Preferences'!A706,\"\")","v":""},{"$f":"IF(A705<=NGrad,Process!A705,\"\")","v":""},{"$f":"IF(A705<=NGrad,COUNTIFS('Graduate Preferences'!B706:ZZ706,C705),\"\")","v":""},{"$f":"IF(A705<=NGrad,IF(D705=0,0,MATCH(C705,'Graduate Preferences'!B706:ZZ706,0)),\"\")","v":""},"","","",null,null,null,""]
[703,{"$f":"IF(A706<=NGrad,'Graduate Preferences'!A707,\"\")","v":""},{"$f":"IF(A706<=NGrad,Process!A706,\"\")","v":""},{"$f":"IF(A706<=NGrad,COUNTIFS('Graduate Preferences'!B707:ZZ707,C706),\"\")","v":""},{"$f":"IF(A706<=NGrad,IF(D706=0,0,MATCH(C706,'Graduate Preferences'!B707:ZZ707,0)),\"\")","v":""},"","","",null,null,null,""]
[704,{"$f":"IF(A707<=NGrad,'Graduate Preferences'!A708,\"\")","v":""},{"$f":"IF(A707<=NGrad,Process!A707,\"\")","v":""},{"$f":"IF(A707<=NGrad,COUNTIFS('Graduate Preferences'!B708:ZZ708,C707),\"\")","v":""},{"$f":"IF(A707<=NGrad,IF(D707=0,0,MATCH(C707,'Graduate Preferences'!B708:ZZ708,0)),\"\")","v":""},"","","",null,null,null,""]
[705,{"$f":"IF(A708<=NGrad,'Graduate Preferences'!A709,\"\")","v":""},{"$f":"IF(A708<=NGrad,Process!A708,\"\")","v":""},{"$f":"IF(A708<=NGrad,COUNTIFS('Graduate Preferences'!B709:ZZ709,C708),\"\")","v":""},{"$f":"IF(A708<=NGrad,IF(D708=0,0,MATCH(C708,'Graduate Preferences'!B709:ZZ709,0)),\"\")","v":""},"","","",null,null,null,""]
[706,{"$f":"IF(A709<=NGrad,'Graduate Preferences'!A710,\"\")","v":""},{"$f":"IF(A709<=NGrad,Process!A709,\"\")","v":""},{"$f":"IF(A709<=NGrad,COUNTIFS('Graduate Preferences'!B710:ZZ710,C709),\"\")","v":""},{"$f":"IF(A709<=NGrad,IF(D709=0,0,MATCH(C709,'Graduate Preferences'!B710:ZZ710,0)),\"\")","v":""},"",{"$f":"IF(F709=\"\",\"\",RANK(F709,F$4:F$1000))","v":""},"",null,null,null,{"$f":"IF(MAX(H$4:H$1000)>=A709,MATCH(A709,H$4:H$1000,0),\"\")","v":""}]
[707,{"$f":"IF(A710<=NGrad,'Graduate Preferences'!A711,\"\")","v":""},{"$f":"IF(A710<=NGrad,Process!A710,\"\")","v":""},{"$f":"IF(A710<=NGrad,COUNTIFS('Graduate Preferences'!B711:ZZ711,C710),\"\")","v":""},{"$f":"IF(A710<=NGrad,IF(D710=0,0,MATCH(C710,'Graduate Preferences'!B711:ZZ711,0)),\"\")","v":""},{"$f":"IF(AND(J710<>\"-\",J710>0,I710=F$2),J710,\"\")","v":""},"",{"$f":"IF(F710=\"\",\"\",MAX(G$4:G$1000)-G710+1)","v":""},null,null,null,""]
[708,{"$f":"IF(A711<=NGrad,'Graduate Preferences'!A712,\"\")","v":""},{"$f":"IF(A711<=NGrad,Process!A711,\"\")","v":""},{"$f":"IF(A711<=NGrad,COUNTIFS('Graduate Preferences'!B712:ZZ712,C711),\"\")","v":""},{"$f":"IF(A711<=NGrad,IF(D711=0,0,MATCH(C711,'Graduate Preferences'!B712:ZZ712,0)),\"\")","v":""},"","","",null,null,null,""]
[709,{"$f":"IF(A712<=NGrad,'Graduate Preferences'!A713,\"\")","v":""},{"$f":"IF(A712<=NGrad,Process!A712,\"\")","v":""},{"$f":"IF(A712<=NGrad,COUNTIFS('Graduate Preferences'!B713:ZZ713,C712),\"\")","v":""},{"$f":"IF(A712<=NGrad,IF(D712=0,0,MATCH(C712,'Graduate Preferences'!B713:ZZ713,0)),\"\")","v":""},"","","",null,null,null,""]
[710,{"$f":"IF(A713<=NGrad,'Graduate Preferences'!A714,\"\")","v":""},{"$f":"IF(A713<=NGrad,Process!A713,\"\")","v":""},{"$f":"IF(A713<=NGrad,COUNTIFS('Graduate Preferences'!B714:ZZ714,C713),\"\")","v":""},{"$f":"IF(A713<=NGrad,IF(D713=0,0,MATCH(C713,'Graduate Preferences'!B714:ZZ714,0)),\"\")","v":""},"","","",null,null,null,""]
[711,{"$f":"IF(A714<=NGrad,'Graduate Preferences'!A715,\"\")","v":""},{"$f":"IF(A714<=NGrad,Process!A714,\"\")","v":""},{"$f":"IF(A714<=NGrad,COUNTIFS('Graduate Preferences'!B715:ZZ715,C714),\"\")","v":""},{"$f":"IF(A714<=NGrad,IF(D714=0,0,MATCH(C714,'Graduate Preferences'!B715:ZZ715,0)),\"\")","v":""},"","","",null,null,null,""]
[712,{"$f":"IF(A715<=NGrad,'Graduate Preferences'!A716,\"\")","v":""},{"$f":"IF(A715<=NGrad,Process!A715,\"\")","v":""},{"$f":"IF(A715<=NGrad,COUNTIFS('Graduate Preferences'!B716:ZZ716,C715),\"\")","v":""},{"$f":"IF(A715<=NGrad,IF(D715=0,0,MATCH(C715,'Graduate Preferences'!B716:ZZ716,0)),\"\")","v":""},"","","",null,null,null,""]
[713,{"$f":"IF(A716<=NGrad,'Graduate Preferences'!A717,\"\")","v":""},{"$f":"IF(A716<=NGrad,Process!A716,\"\")","v":""},{"$f":"IF(A716<=NGrad,COUNTIFS('Graduate Preferences'!B717:ZZ717,C716),\"\")","v":""},{"$f":"IF(A716<=NGrad,IF(D716=0,0,MATCH(C716,'Graduate Preferences'!B717:ZZ717,0)),\"\")","v":""},"","","",null,null,null,""]
[714,{"$f":"IF(A717<=NGrad,'Graduate Preferences'!A718,\"\")","v":""},{"$f":"IF(A717<=NGrad,Process!A717,\"\")","v":""},{"$f":"IF(A717<=NGrad,COUNTIFS('Graduate Preferences'!B718:ZZ718,C717),\"\")","v":""},{"$f":"IF(A717<=NGrad,IF(D717=0,0,MATCH(C717,'Graduate Preferences'!B718:ZZ718,0)),\"\")","v":""},"","","",null,null,null,""]
[715,{"$f":"IF(A718<=NGrad,'Graduate Preferences'!A719,\"\")","v":""},{"$f":"IF(A718<=NGrad,Process!A718,\"\")","v":""},{"$f":"IF(A718<=NGrad,COUNTIFS('Graduate Preferences'!B719:ZZ719,C718),\"\")","v":""},{"$f":"IF(A718<=NGrad,IF(D718=0,0,MATCH(C718,'Graduate Preferences'!B719:ZZ719,0)),\"\")","v":""},"","","",null,null,null,""]
[716,{"$f":"IF(A719<=NGrad,'Graduate Preferences'!A720,\"\")","v":""},{"$f":"IF(A719<=NGrad,Process!A719,\"\")","v":""},{"$f":"IF(A719<=NGrad,COUNTIFS('Graduate Preferences'!B720:ZZ720,C719),\"\")","v":""},{"$f":"IF(A719<=NGrad,IF(D719=0,0,MATCH(C719,'Graduate Preferences'!B720:ZZ720,0)),\"\")","v":""},"","","",null,null,null,""]
[717,{"$f":"IF(A720<=NGrad,'Graduate Preferences'!A721,\"\")","v":""},{"$f":"IF(A720<=NGrad,Process!A720,\"\")","v":""},{"$f":"IF(A720<=NGrad,COUNTIFS('Graduate Preferences'!B721:ZZ721,C720),\"\")","v":""},{"$f":"IF(A720<=NGrad,IF(D720=0,0,MATCH(C720,'Graduate Preferences'!B721:ZZ721,0)),\"\")","v":""},"","","",null,null,null,""]
[718,{"$f":"IF(A721<=NGrad,'Graduate Preferences'!A722,\"\")","v":""},{"$f":"IF(A721<=NGrad,Process!A721,\"\")","v":""},{"$f":"IF(A721<=NGrad,COUNTIFS('Graduate Preferences'!B722:ZZ722,C721),\"\")","v":""},{"$f":"IF(A721<=NGrad,IF(D721=0,0,MATCH(C721,'Graduate Preferences'!B722:ZZ722,0)),\"\")","v":""},"","","",null,null,null,""]
[719,{"$f":"IF(A722<=NGrad,'Graduate Preferences'!A723,\"\")","v":""},{"$f":"IF(A722<=NGrad,Process!A722,\"\")","v":""},{"$f":"IF(A722<=NGrad,COUNTIFS('Graduate Preferences'!B723:ZZ723,C722),\"\")","v":""},{"$f":"IF(A722<=NGrad,IF(D722=0,0,MATCH(C722,'Graduate Preferences'!B723:ZZ723,0)),\"\")","v":""},"","","",null,null,null,""]
[720,{"$f":"IF(A723<=NGrad,'Graduate Preferences'!A724,\"\")","v":""},{"$f":"IF(A723<=NGrad,Process!A723,\"\")","v":""},{"$f":"IF(A723<=NGrad,COUNTIFS('Graduate Preferences'!B724:ZZ724,C723),\"\")","v":""},{"$f":"IF(A723<=NGrad,IF(D723=0,0,MATCH(C723,'Graduate Preferences'!B724:ZZ724,0)),\"\")","v":""},"","","",null,null,null,""]
[721,{"$f":"IF(A724<=NGrad,'Graduate Preferences'!A725,\"\")","v":""},{"$f":"IF(A724<=NGrad,Process!A724,\"\")","v":""},{"$f":"IF(A724<=NGrad,COUNTIFS('Graduate Preferences'!B725:ZZ725,C724),\"\")","v":""},{"$f":"IF(A724<=NGrad,IF(D724=0,0,MATCH(C724,'Graduate Preferences'!B725:ZZ725,0)),\"\")","v":""},"","","",null,null,null,""]
[722,{"$f":"IF(A725<=NGrad,'Graduate Preferences'!A726,\"\")","v":""},{"$f":"IF(A725<=NGrad,Process!A725,\"\")","v":""},{"$f":"IF(A725<=NGrad,COUNTIFS('Graduate Preferences'!B726:ZZ726,C725),\"\")","v":""},{"$f":"IF(A725<=NGrad,IF(D725=0,0,MATCH(C725,'Graduate Preferences'!B726:ZZ726,0)),\"\")","v":""},"","","",null,null,null,""]
[723,{"$f":"IF(A726<=NGrad,'Graduate Preferences'!A727,\"\")","v":""},{"$f":"IF(A726<=NGrad,Process!A726,\"\")","v":""},{"$f":"IF(A726<=NGrad,COUNTIFS('Graduate Preferences'!B727:ZZ727,C726),\"\")","v":""},{"$f":"IF(A726<=NGrad,IF(D726=0,0,MATCH(C726,'Graduate Preferences'!B727:ZZ727,0)),\"\")","v":""},"","","",null,null,null,""]
[724,{"$f":"IF(A727<=NGrad,'Graduate Preferences'!A728,\"\")","v":""},{"$f":"IF(A727<=NGrad,Process!A727,\"\")","v":""},{"$f":"IF(A727<=NGrad,COUNTIFS('Graduate Preferences'!B728:ZZ728,C727),\"\")","v":""},{"$f":"IF(A727<=NGrad,IF(D727=0,0,MATCH(C727,'Graduate Preferences'!B728:ZZ728,0)),\"\")","v":""},"","","",null,null,null,""]
[725,{"$f":"IF(A728<=NGrad,'Graduate Preferences'!A729,\"\")","v":""},{"$f":"IF(A728<=NGrad,Process!A728,\"\")","v":""},{"$f":"IF(A728<=NGrad,COUNTIFS('Graduate Preferences'!B729:ZZ729,C728),\"\")","v":""},{"$f":"IF(A728<=NGrad,IF(D728=0,0,MATCH(C728,'Graduate Preferences'!B729:ZZ729,0)),\"\")","v":""},"","","",null,null,null,""]
[726,{"$f":"IF(A729<=NGrad,'Graduate Preferences'!A730,\"\")","v":""},{"$f":"IF(A729<=NGrad,Process!A729,\"\")","v":""},{"$f":"IF(A729<=NGrad,COUNTIFS('Graduate Preferences'!B730:ZZ730,C729),\"\")","v":""},{"$f":"IF(A729<=NGrad,IF(D729=0,0,MATCH(C729,'Graduate Preferences'!B730:ZZ730,0)),\"\")","v":""},"","","",null,null,null,""]
[727,{"$f":"IF(A730<=NGrad,'Graduate Preferences'!A731,\"\")","v":""},{"$f":"IF(A730<=NGrad,Process!A730,\"\")","v":""},{"$f":"IF(A730<=NGrad,COUNTIFS('Graduate Preferences'!B731:ZZ731,C730),\"\")","v":""},{"$f":"IF(A730<=NGrad,IF(D730=0,0,MATCH(C730,'Graduate Preferences'!B731:ZZ731,0)),\"\")","v":""},"","","",null,null,null,""]
[728,{"$f":"IF(A731<=NGrad,'Graduate Preferences'!A732,\"\")","v":""},{"$f":"IF(A731<=NGrad,Process!A731,\"\")","v":""},{"$f":"IF(A731<=NGrad,COUNTIFS('Graduate Preferences'!B732:ZZ732,C731),\"\")","v":""},{"$f":"IF(A731<=NGrad,IF(D731=0,0,MATCH(C731,'Graduate Preferences'!B732:ZZ732,0)),\"\")","v":""},"","","",null,null,null,""]
[729,{"$f":"IF(A732<=NGrad,'Graduate Preferences'!A733,\"\")","v":""},{"$f":"IF(A732<=NGrad,Process!A732,\"\")","v":""},{"$f":"IF(A732<=NGrad,COUNTIFS('Graduate Preferences'!B733:ZZ733,C732),\"\")","v":""},{"$f":"IF(A732<=NGrad,IF(D732=0,0,MATCH(C732,'Graduate Preferences'!B733:ZZ733,0)),\"\")","v":""},"","","",null,null,null,""]
[730,{"$f":"IF(A733<=NGrad,'Graduate Preferences'!A734,\"\")","v":""},{"$f":"IF(A733<=NGrad,Process!A733,\"\")","v":""},{"$f":"IF(A733<=NGrad,COUNTIFS('Graduate Preferences'!B734:ZZ734,C733),\"\")","v":""},{"$f":"IF(A733<=NGrad,IF(D733=0,0,MATCH(C733,'Graduate Preferences'!B734:ZZ734,0)),\"\")","v":""},"","","",null,null,null,""]
[731,{"$f":"IF(A734<=NGrad,'Graduate Preferences'!A735,\"\")","v":""},{"$f":"IF(A734<=NGrad,Process!A734,\"\")","v":""},{"$f":"IF(A734<=NGrad,COUNTIFS('Graduate Preferences'!B735:ZZ735,C734),\"\")","v":""},{"$f":"IF(A734<=NGrad,IF(D734=0,0,MATCH(C734,'Graduate Preferences'!B735:ZZ735,0)),\"\")","v":""},"","","",null,null,null,""]
[732,{"$f":"IF(A735<=NGrad,'Graduate Preferences'!A736,\"\")","v":""},{"$f":"IF(A735<=NGrad,Process!A735,\"\")","v":""},{"$f":"IF(A735<=NGrad,COUNTIFS('Graduate Preferences'!B736:ZZ736,C735),\"\")","v":""},{"$f":"IF(A735<=NGrad,IF(D735=0,0,MATCH(C735,'Graduate Preferences'!B736:ZZ736,0)),\"\")","v":""},"","","",null,null,null,""]
[733,{"$f":"IF(A736<=NGrad,'Graduate Preferences'!A737,\"\")","v":""},{"$f":"IF(A736<=NGrad,Process!A736,\"\")","v":""},{"$f":"IF(A736<=NGrad,COUNTIFS('Graduate Preferences'!B737:ZZ737,C736),\"\")","v":""},{"$f":"IF(A736<=NGrad,IF(D736=0,0,MATCH(C736,'Graduate Preferences'!B737:ZZ737,0)),\"\")","v":""},"","","",null,null,null,""]
[734,{"$f":"IF(A737<=NGrad,'Graduate Preferences'!A738,\"\")","v":""},{"$f":"IF(A737<=NGrad,Process!A737,\"\")","v":""},{"$f":"IF(A737<=NGrad,COUNTIFS('Graduate Preferences'!B738:ZZ738,C737),\"\")","v":""},{"$f":"IF(A737<=NGrad,IF(D737=0,0,MATCH(C737,'Graduate Preferences'!B738:ZZ738,0)),\"\")","v":""},"","","",null,null,null,""]
[735,{"$f":"IF(A738<=NGrad,'Graduate Preferences'!A739,\"\")","v":""},{"$f":"IF(A738<=NGrad,Process!A738,\"\")","v":""},{"$f":"IF(A738<=NGrad,COUNTIFS('Graduate Preferences'!B739:ZZ739,C738),\"\")","v":""},{"$f":"IF(A738<=NGrad,IF(D738=0,0,MATCH(C738,'Graduate Preferences'!B739:ZZ739,0)),\"\")","v":""},"","","",null,null,null,""]
[736,{"$f":"IF(A739<=NGrad,'Graduate Preferences'!A740,\"\")","v":""},{"$f":"IF(A739<=NGrad,Process!A739,\"\")","v":""},{"$f":"IF(A739<=NGrad,COUNTIFS('Graduate Preferences'!B740:ZZ740,C739),\"\")","v":""},{"$f":"IF(A739<=NGrad,IF(D739=0,0,MATCH(C739,'Graduate Preferences'!B740:ZZ740,0)),\"\")","v":""},"","","",null,null,null,""]
[737,{"$f":"IF(A740<=NGrad,'Graduate Preferences'!A741,\"\")","v":""},{"$f":"IF(A740<=NGrad,Process!A740,\"\")","v":""},{"$f":"IF(A740<=NGrad,COUNTIFS('Graduate Preferences'!B741:ZZ741,C740),\"\")","v":""},{"$f":"IF(A740<=NGrad,IF(D740=0,0,MATCH(C740,'Graduate Preferences'!B741:ZZ741,0)),\"\")","v":""},"","","",null,null,null,""]
[738,{"$f":"IF(A741<=NGrad,'Graduate Preferences'!A742,\"\")","v":""},{"$f":"IF(A741<=NGrad,Process!A741,\"\")","v":""},{"$f":"IF(A741<=NGrad,COUNTIFS('Graduate Preferences'!B742:ZZ742,C741),\"\")","v":""},{"$f":"IF(A741<=NGrad,IF(D741=0,0,MATCH(C741,'Graduate Preferences'!B742:ZZ742,0)),\"\")","v":""},"","","",null,null,null,""]
[739,{"$f":"IF(A742<=NGrad,'Graduate Preferences'!A743,\"\")","v":""},{"$f":"IF(A742<=NGrad,Process!A742,\"\")","v":""},{"$f":"IF(A742<=NGrad,COUNTIFS('Graduate Preferences'!B743:ZZ743,C742),\"\")","v":""},{"$f":"IF(A742<=NGrad,IF(D742=0,0,MATCH(C742,'Graduate Preferences'!B743:ZZ743,0)),\"\")","v":""},"","","",null,null,null,""]
[740,{"$f":"IF(A743<=NGrad,'Graduate Preferences'!A744,\"\")","v":""},{"$f":"IF(A743<=NGrad,Process!A743,\"\")","v":""},{"$f":"IF(A743<=NGrad,COUNTIFS('Graduate Preferences'!B744:ZZ744,C743),\"\")","v":""},{"$f":"IF(A743<=NGrad,IF(D743=0,0,MATCH(C743,'Graduate Preferences'!B744:ZZ744,0)),\"\")","v":""},"","","",null,null,null,""]
[741,{"$f":"IF(A744<=NGrad,'Graduate Preferences'!A745,\"\")","v":""},{"$f":"IF(A744<=NGrad,Process!A744,\"\")","v":""},{"$f":"IF(A744<=NGrad,COUNTIFS('Graduate Preferences'!B745:ZZ745,C744),\"\")","v":""},{"$f":"IF(A744<=NGrad,IF(D744=0,0,MATCH(C744,'Graduate Preferences'!B745:ZZ745,0)),\"\")","v":""},"","","",null,null,null,""]
[742,{"$f":"IF(A745<=NGrad,'Graduate Preferences'!A746,\"\")","v":""},{"$f":"IF(A745<=NGrad,Process!A745,\"\")","v":""},{"$f":"IF(A745<=NGrad,COUNTIFS('Graduate Preferences'!B746:ZZ746,C745),\"\")","v":""},{"$f":"IF(A745<=NGrad,IF(D745=0,0,MATCH(C745,'Graduate Preferences'!B746:ZZ746,0)),\"\")","v":""},"","","",null,null,null,""]
[743,{"$f":"IF(A746<=NGrad,'Graduate Preferences'!A747,\"\")","v":""},{"$f":"IF(A746<=NGrad,Process!A746,\"\")","v":""},{"$f":"IF(A746<=NGrad,COUNTIFS('Graduate Preferences'!B747:ZZ747,C746),\"\")","v":""},{"$f":"IF(A746<=NGrad,IF(D746=0,0,MATCH(C746,'Graduate Preferences'!B747:ZZ747,0)),\"\")","v":""},"","","",null,null,null,""]
[744,{"$f":"IF(A747<=NGrad,'Graduate Preferences'!A748,\"\")","v":""},{"$f":"IF(A747<=NGrad,Process!A747,\"\")","v":""},{"$f":"IF(A747<=NGrad,COUNTIFS('Graduate Preferences'!B748:ZZ748,C747),\"\")","v":""},{"$f":"IF(A747<=NGrad,IF(D747=0,0,MATCH(C747,'Graduate Preferences'!B748:ZZ748,0)),\"\")","v":""},"","","",null,null,null,""]
[745,{"$f":"IF(A748<=NGrad,'Graduate Preferences'!A749,\"\")","v":""},{"$f":"IF(A748<=NGrad,Process!A748,\"\")","v":""},{"$f":"IF(A748<=NGrad,COUNTIFS('Graduate Preferences'!B749:ZZ749,C748),\"\")","v":""},{"$f":"IF(A748<=NGrad,IF(D748=0,0,MATCH(C748,'Graduate Preferences'!B749:ZZ749,0)),\"\")","v":""},"","","",null,null,null,""]
[746,{"$f":"IF(A749<=NGrad,'Graduate Preferences'!A750,\"\")","v":""},{"$f":"IF(A749<=NGrad,Process!A749,\"\")","v":""},{"$f":"IF(A749<=NGrad,COUNTIFS('Graduate Preferences'!B750:ZZ750,C749),\"\")","v":""},{"$f":"IF(A749<=NGrad,IF(D749=0,0,MATCH(C749,'Graduate Preferences'!B750:ZZ750,0)),\"\")","v":""},"","","",null,null,null,""]
[747,{"$f":"IF(A750<=NGrad,'Graduate Preferences'!A751,\"\")","v":""},{"$f":"IF(A750<=NGrad,Process!A750,\"\")","v":""},{"$f":"IF(A750<=NGrad,COUNTIFS('Graduate Preferences'!B751:ZZ751,C750),\"\")","v":""},{"$f":"IF(A750<=NGrad,IF(D750=0,0,MATCH(C750,'Graduate Preferences'!B751:ZZ751,0)),\"\")","v":""},"","","",null,null,null,""]
[748,{"$f":"IF(A751<=NGrad,'Graduate Preferences'!A752,\"\")","v":""},{"$f":"IF(A751<=NGrad,Process!A751,\"\")","v":""},{"$f":"IF(A751<=NGrad,COUNTIFS('Graduate Preferences'!B752:ZZ752,C751),\"\")","v":""},{"$f":"IF(A751<=NGrad,IF(D751=0,0,MATCH(C751,'Graduate Preferences'!B752:ZZ752,0)),\"\")","v":""},"","","",null,null,null,""]
[749,{"$f":"IF(A752<=NGrad,'Graduate Preferences'!A753,\"\")","v":""},{"$f":"IF(A752<=NGrad,Process!A752,\"\")","v":""},{"$f":"IF(A752<=NGrad,COUNTIFS('Graduate Preferences'!B753:ZZ753,C752),\"\")","v":""},{"$f":"IF(A752<=NGrad,IF(D752=0,0,MATCH(C752,'Graduate Preferences'!B753:ZZ753,0)),\"\")","v":""},"","","",null,null,null,""]
[750,{"$f":"IF(A753<=NGrad,'Graduate Preferences'!A754,\"\")","v":""},{"$f":"IF(A753<=NGrad,Process!A753,\"\")","v":""},{"$f":"IF(A753<=NGrad,COUNTIFS('Graduate Preferences'!B754:ZZ754,C753),\"\")","v":""},{"$f":"IF(A753<=NGrad,IF(D753=0,0,MATCH(C753,'Graduate Preferences'!B754:ZZ754,0)),\"\")","v":""},"","","",null,null,null,""]
[751,{"$f":"IF(A754<=NGrad,'Graduate Preferences'!A755,\"\")","v":""},{"$f":"IF(A754<=NGrad,Process!A754,\"\")","v":""},{"$f":"IF(A754<=NGrad,COUNTIFS('Graduate Preferences'!B755:ZZ755,C754),\"\")","v":""},{"$f":"IF(A754<=NGrad,IF(D754=0,0,MATCH(C754,'Graduate Preferences'!B755:ZZ755,0)),\"\")","v":""},"","","",null,null,null,""]
[752,{"$f":"IF(A755<=NGrad,'Graduate Preferences'!A756,\"\")","v":""},{"$f":"IF(A755<=NGrad,Process!A755,\"\")","v":""},{"$f":"IF(A755<=NGrad,COUNTIFS('Graduate Preferences'!B756:ZZ756,C755),\"\")","v":""},{"$f":"IF(A755<=NGrad,IF(D755=0,0,MATCH(C755,'Graduate Preferences'!B756:ZZ756,0)),\"\")","v":""},"","","",null,null,null,""]
[753,{"$f":"IF(A756<=NGrad,'Graduate Preferences'!A757,\"\")","v":""},{"$f":"IF(A756<=NGrad,Process!A756,\"\")","v":""},{"$f":"IF(A756<=NGrad,COUNTIFS('Graduate Preferences'!B757:ZZ757,C756),\"\")","v":""},{"$f":"IF(A756<=NGrad,IF(D756=0,0,MATCH(C756,'Graduate Preferences'!B757:ZZ757,0)),\"\")","v":""},"","","",null,null,null,""]
[754,{"$f":"IF(A757<=NGrad,'Graduate Preferences'!A758,\"\")","v":""},{"$f":"IF(A757<=NGrad,Process!A757,\"\")","v":""},{"$f":"IF(A757<=NGrad,COUNTIFS('Graduate Preferences'!B758:ZZ758,C757),\"\")","v":""},{"$f":"IF(A757<=NGrad,IF(D757=0,0,MATCH(C757,'Graduate Preferences'!B758:ZZ758,0)),\"\")","v":""},"","","",null,null,null,""]
[755,{"$f":"IF(A758<=NGrad,'Graduate Preferences'!A759,\"\")","v":""},{"$f":"IF(A758<=NGrad,Process!A758,\"\")","v":""},{"$f":"IF(A758<=NGrad,COUNTIFS('Graduate Preferences'!B759:ZZ759,C758),\"\")","v":""},{"$f":"IF(A758<=NGrad,IF(D758=0,0,MATCH(C758,'Graduate Preferences'!B759:ZZ759,0)),\"\")","v":""},"","","",null,null,null,""]
[756,{"$f":"IF(A759<=NGrad,'Graduate Preferences'!A760,\"\")","v":""},{"$f":"IF(A759<=NGrad,Process!A759,\"\")","v":""},{"$f":"IF(A759<=NGrad,COUNTIFS('Graduate Preferences'!B760:ZZ760,C759),\"\")","v":""},{"$f":"IF(A759<=NGrad,IF(D759=0,0,MATCH(C759,'Graduate Preferences'!B760:ZZ760,0)),\"\")","v":""},"","","",null,null,null,""]
[757,{"$f":"IF(A760<=NGrad,'Graduate Preferences'!A761,\"\")","v":""},{"$f":"IF(A760<=NGrad,Process!A760,\"\")","v":""},{"$f":"IF(A760<=NGrad,COUNTIFS('Graduate Preferences'!B761:ZZ761,C760),\"\")","v":""},{"$f":"IF(A760<=NGrad,IF(D760=0,0,MATCH(C760,'Graduate Preferences'!B761:ZZ761,0)),\"\")","v":""},"","","",null,null,null,""]
[758,{"$f":"IF(A761<=NGrad,'Graduate Preferences'!A762,\"\")","v":""},{"$f":"IF(A761<=NGrad,Process!A761,\"\")","v":""},{"$f":"IF(A761<=NGrad,COUNTIFS('Graduate Preferences'!B762:ZZ762,C761),\"\")","v":""},{"$f":"IF(A761<=NGrad,IF(D761=0,0,MATCH(C761,'Graduate Preferences'!B762:ZZ762,0)),\"\")","v":""},"","","",null,null,null,""]
[759,{"$f":"IF(A762<=NGrad,'Graduate Preferences'!A763,\"\")","v":""},{"$f":"IF(A762<=NGrad,Process!A762,\"\")","v":""},{"$f":"IF(A762<=NGrad,COUNTIFS('Graduate Preferences'!B763:ZZ763,C762),\"\")","v":""},{"$f":"IF(A762<=NGrad,IF(D762=0,0,MATCH(C762,'Graduate Preferences'!B763:ZZ763,0)),\"\")","v":""},"","","",null,null,null,""]
[760,{"$f":"IF(A763<=NGrad,'Graduate Preferences'!A764,\"\")","v":""},{"$f":"IF(A763<=NGrad,Process!A763,\"\")","v":""},{"$f":"IF(A763<=NGrad,COUNTIFS('Graduate Preferences'!B764:ZZ764,C763),\"\")","v":""},{"$f":"IF(A763<=NGrad,IF(D763=0,0,MATCH(C763,'Graduate Preferences'!B764:ZZ764,0)),\"\")","v":""},"","","",null,null,null,""]
[761,{"$f":"IF(A764<=NGrad,'Graduate Preferences'!A765,\"\")","v":""},{"$f":"IF(A764<=NGrad,Process!A764,\"\")","v":""},{"$f":"IF(A764<=NGrad,COUNTIFS('Graduate Preferences'!B765:ZZ765,C764),\"\")","v":""},{"$f":"IF(A764<=NGrad,IF(D764=0,0,MATCH(C764,'Graduate Preferences'!B765:ZZ765,0)),\"\")","v":""},"","","",null,null,null,""]
[762,{"$f":"IF(A765<=NGrad,'Graduate Preferences'!A766,\"\")","v":""},{"$f":"IF(A765<=NGrad,Process!A765,\"\")","v":""},{"$f":"IF(A765<=NGrad,COUNTIFS('Graduate Preferences'!B766:ZZ766,C765),\"\")","v":""},{"$f":"IF(A765<=NGrad,IF(D765=0,0,MATCH(C765,'Graduate Preferences'!B766:ZZ766,0)),\"\")","v":""},"","","",null,null,null,""]
[763,{"$f":"IF(A766<=NGrad,'Graduate Preferences'!A767,\"\")","v":""},{"$f":"IF(A766<=NGrad,Process!A766,\"\")","v":""},{"$f":"IF(A766<=NGrad,COUNTIFS('Graduate Preferences'!B767:ZZ767,C766),\"\")","v":""},{"$f":"IF(A766<=NGrad,IF(D766=0,0,MATCH(C766,'Graduate Preferences'!B767:ZZ767,0)),\"\")","v":""},"","","",null,null,null,""]
[764,{"$f":"IF(A767<=NGrad,'Graduate Preferences'!A768,\"\")","v":""},{"$f":"IF(A767<=NGrad,Process!A767,\"\")","v":""},{"$f":"IF(A767<=NGrad,COUNTIFS('Graduate Preferences'!B768:ZZ768,C767),\"\")","v":""},{"$f":"IF(A767<=NGrad,IF(D767=0,0,MATCH(C767,'Graduate Preferences'!B768:ZZ768,0)),\"\")","v":""},"","","",null,null,null,""]
[765,{"$f":"IF(A768<=NGrad,'Graduate Preferences'!A769,\"\")","v":""},{"$f":"IF(A768<=NGrad,Process!A768,\"\")","v":""},{"$f":"IF(A768<=NGrad,COUNTIFS('Graduate Preferences'!B769:ZZ769,C768),\"\")","v":""},{"$f":"IF(A768<=NGrad,IF(D768=0,0,MATCH(C768,'Graduate Preferences'!B769:ZZ769,0)),\"\")","v":""},"","","",null,null,null,""]
[766,{"$f":"IF(A769<=NGrad,'Graduate Preferences'!A770,\"\")","v":""},{"$f":"IF(A769<=NGrad,Process!A769,\"\")","v":""},{"$f":"IF(A769<=NGrad,COUNTIFS('Graduate Preferences'!B770:ZZ770,C769),\"\")","v":""},{"$f":"IF(A769<=NGrad,IF(D769=0,0,MATCH(C769,'Graduate Preferences'!B770:ZZ770,0)),\"\")","v":""},"","","",null,null,null,""]
[767,{"$f":"IF(A770<=NGrad,'Graduate Preferences'!A771,\"\")","v":""},{"$f":"IF(A770<=NGrad,Process!A770,\"\")","v":""},{"$f":"IF(A770<=NGrad,COUNTIFS('Graduate Preferences'!B771:ZZ771,C770),\"\")","v":""},{"$f":"IF(A770<=NGrad,IF(D770=0,0,MATCH(C770,'Graduate Preferences'!B771:ZZ771,0)),\"\")","v":""},"","","",null,null,null,""]
[768,{"$f":"IF(A771<=NGrad,'Graduate Preferences'!A772,\"\")","v":""},{"$f":"IF(A771<=NGrad,Process!A771,\"\")","v":""},{"$f":"IF(A771<=NGrad,COUNTIFS('Graduate Preferences'!B772:ZZ772,C771),\"\")","v":""},{"$f":"IF(A771<=NGrad,IF(D771=0,0,MATCH(C771,'Graduate Preferences'!B772:ZZ772,0)),\"\")","v":""},"","","",null,null,null,""]
[769,{"$f":"IF(A772<=NGrad,'Graduate Preferences'!A773,\"\")","v":""},{"$f":"IF(A772<=NGrad,Process!A772,\"\")","v":""},{"$f":"IF(A772<=NGrad,COUNTIFS('Graduate Preferences'!B773:ZZ773,C772),\"\")","v":""},{"$f":"IF(A772<=NGrad,IF(D772=0,0,MATCH(C772,'Graduate Preferences'!B773:ZZ773,0)),\"\")","v":""},"","","",null,null,null,""]
[770,{"$f":"IF(A773<=NGrad,'Graduate Preferences'!A774,\"\")","v":""},{"$f":"IF(A773<=NGrad,Process!A773,\"\")","v":""},{"$f":"IF(A773<=NGrad,COUNTIFS('Graduate Preferences'!B774:ZZ774,C773),\"\")","v":""},{"$f":"IF(A773<=NGrad,IF(D773=0,0,MATCH(C773,'Graduate Preferences'!B774:ZZ774,0)),\"\")","v":""},"",{"$f":"IF(F773=\"\",\"\",RANK(F773,F$4:F$1000))","v":""},"",null,null,null,{"$f":"IF(MAX(H$4:H$1000)>=A773,MATCH(A773,H$4:H$1000,0),\"\")","v":""}]
[771,{"$f":"IF(A774<=NGrad,'Graduate Preferences'!A775,\"\")","v":""},{"$f":"IF(A774<=NGrad,Process!A774,\"\")","v":""},{"$f":"IF(A774<=NGrad,COUNTIFS('Graduate Preferences'!B775:ZZ775,C774),\"\")","v":""},{"$f":"IF(A774<=NGrad,IF(D774=0,0,MATCH(C774,'Graduate Preferences'!B775:ZZ775,0)),\"\")","v":""},{"$f":"IF(AND(J774<>\"-\",J774>0,I774=F$2),J774,\"\")","v":""},"",{"$f":"IF(F774=\"\",\"\",MAX(G$4:G$1000)-G774+1)","v":""},null,null,null,""]
[772,{"$f":"IF(A775<=NGrad,'Graduate Preferences'!A776,\"\")","v":""},{"$f":"IF(A775<=NGrad,Process!A775,\"\")","v":""},{"$f":"IF(A775<=NGrad,COUNTIFS('Graduate Preferences'!B776:ZZ776,C775),\"\")","v":""},{"$f":"IF(A775<=NGrad,IF(D775=0,0,MATCH(C775,'Graduate Preferences'!B776:ZZ776,0)),\"\")","v":""},"","","",null,null,null,""]
[773,{"$f":"IF(A776<=NGrad,'Graduate Preferences'!A777,\"\")","v":""},{"$f":"IF(A776<=NGrad,Process!A776,\"\")","v":""},{"$f":"IF(A776<=NGrad,COUNTIFS('Graduate Preferences'!B777:ZZ777,C776),\"\")","v":""},{"$f":"IF(A776<=NGrad,IF(D776=0,0,MATCH(C776,'Graduate Preferences'!B777:ZZ777,0)),\"\")","v":""},"","","",null,null,null,""]
[774,{"$f":"IF(A777<=NGrad,'Graduate Preferences'!A778,\"\")","v":""},{"$f":"IF(A777<=NGrad,Process!A777,\"\")","v":""},{"$f":"IF(A777<=NGrad,COUNTIFS('Graduate Preferences'!B778:ZZ778,C777),\"\")","v":""},{"$f":"IF(A777<=NGrad,IF(D777=0,0,MATCH(C777,'Graduate Preferences'!B778:ZZ778,0)),\"\")","v":""},"","","",null,null,null,""]
[775,{"$f":"IF(A778<=NGrad,'Graduate Preferences'!A779,\"\")","v":""},{"$f":"IF(A778<=NGrad,Process!A778,\"\")","v":""},{"$f":"IF(A778<=NGrad,COUNTIFS('Graduate Preferences'!B779:ZZ779,C778),\"\")","v":""},{"$f":"IF(A778<=NGrad,IF(D778=0,0,MATCH(C778,'Graduate Preferences'!B779:ZZ779,0)),\"\")","v":""},"","","",null,null,null,""]
[776,{"$f":"IF(A779<=NGrad,'Graduate Preferences'!A780,\"\")","v":""},{"$f":"IF(A779<=NGrad,Process!A779,\"\")","v":""},{"$f":"IF(A779<=NGrad,COUNTIFS('Graduate Preferences'!B780:ZZ780,C779),\"\")","v":""},{"$f":"IF(A779<=NGrad,IF(D779=0,0,MATCH(C779,'Graduate Preferences'!B780:ZZ780,0)),\"\")","v":""},"","","",null,null,null,""]
[777,{"$f":"IF(A780<=NGrad,'Graduate Preferences'!A781,\"\")","v":""},{"$f":"IF(A780<=NGrad,Process!A780,\"\")","v":""},{"$f":"IF(A780<=NGrad,COUNTIFS('Graduate Preferences'!B781:ZZ781,C780),\"\")","v":""},{"$f":"IF(A780<=NGrad,IF(D780=0,0,MATCH(C780,'Graduate Preferences'!B781:ZZ781,0)),\"\")","v":""},"","","",null,null,null,""]
[778,{"$f":"IF(A781<=NGrad,'Graduate Preferences'!A782,\"\")","v":""},{"$f":"IF(A781<=NGrad,Process!A781,\"\")","v":""},{"$f":"IF(A781<=NGrad,COUNTIFS('Graduate Preferences'!B782:ZZ782,C781),\"\")","v":""},{"$f":"IF(A781<=NGrad,IF(D781=0,0,MATCH(C781,'Graduate Preferences'!B782:ZZ782,0)),\"\")","v":""},"","","",null,null,null,""]
[779,{"$f":"IF(A782<=NGrad,'Graduate Preferences'!A783,\"\")","v":""},{"$f":"IF(A782<=NGrad,Process!A782,\"\")","v":""},{"$f":"IF(A782<=NGrad,COUNTIFS('Graduate Preferences'!B783:ZZ783,C782),\"\")","v":""},{"$f":"IF(A782<=NGrad,IF(D782=0,0,MATCH(C782,'Graduate Preferences'!B783:ZZ783,0)),\"\")","v":""},"","","",null,null,null,""]
[780,{"$f":"IF(A783<=NGrad,'Graduate Preferences'!A784,\"\")","v":""},{"$f":"IF(A783<=NGrad,Process!A783,\"\")","v":""},{"$f":"IF(A783<=NGrad,COUNTIFS('Graduate Preferences'!B784:ZZ784,C783),\"\")","v":""},{"$f":"IF(A783<=NGrad,IF(D783=0,0,MATCH(C783,'Graduate Preferences'!B784:ZZ784,0)),\"\")","v":""},"","","",null,null,null,""]
[781,{"$f":"IF(A784<=NGrad,'Graduate Preferences'!A785,\"\")","v":""},{"$f":"IF(A784<=NGrad,Process!A784,\"\")","v":""},{"$f":"IF(A784<=NGrad,COUNTIFS('Graduate Preferences'!B785:ZZ785,C784),\"\")","v":""},{"$f":"IF(A784<=NGrad,IF(D784=0,0,MATCH(C784,'Graduate Preferences'!B785:ZZ785,0)),\"\")","v":""},"","","",null,null,null,""]
[782,{"$f":"IF(A785<=NGrad,'Graduate Preferences'!A786,\"\")","v":""},{"$f":"IF(A785<=NGrad,Process!A785,\"\")","v":""},{"$f":"IF(A785<=NGrad,COUNTIFS('Graduate Preferences'!B786:ZZ786,C785),\"\")","v":""},{"$f":"IF(A785<=NGrad,IF(D785=0,0,MATCH(C785,'Graduate Preferences'!B786:ZZ786,0)),\"\")","v":""},"","","",null,null,null,""]
[783,{"$f":"IF(A786<=NGrad,'Graduate Preferences'!A787,\"\")","v":""},{"$f":"IF(A786<=NGrad,Process!A786,\"\")","v":""},{"$f":"IF(A786<=NGrad,COUNTIFS('Graduate Preferences'!B787:ZZ787,C786),\"\")","v":""},{"$f":"IF(A786<=NGrad,IF(D786=0,0,MATCH(C786,'Graduate Preferences'!B787:ZZ787,0)),\"\")","v":""},"","","",null,null,null,""]
[784,{"$f":"IF(A787<=NGrad,'Graduate Preferences'!A788,\"\")","v":""},{"$f":"IF(A787<=NGrad,Process!A787,\"\")","v":""},{"$f":"IF(A787<=NGrad,COUNTIFS('Graduate Preferences'!B788:ZZ788,C787),\"\")","v":""},{"$f":"IF(A787<=NGrad,IF(D787=0,0,MATCH(C787,'Graduate Preferences'!B788:ZZ788,0)),\"\")","v":""},"","","",null,null,null,""]
[785,{"$f":"IF(A788<=NGrad,'Graduate Preferences'!A789,\"\")","v":""},{"$f":"IF(A788<=NGrad,Process!A788,\"\")","v":""},{"$f":"IF(A788<=NGrad,COUNTIFS('Graduate Preferences'!B789:ZZ789,C788),\"\")","v":""},{"$f":"IF(A788<=NGrad,IF(D788=0,0,MATCH(C788,'Graduate Preferences'!B789:ZZ789,0)),\"\")","v":""},"","","",null,null,null,""]
[786,{"$f":"IF(A789<=NGrad,'Graduate Preferences'!A790,\"\")","v":""},{"$f":"IF(A789<=NGrad,Process!A789,\"\")","v":""},{"$f":"IF(A789<=NGrad,COUNTIFS('Graduate Preferences'!B790:ZZ790,C789),\"\")","v":""},{"$f":"IF(A789<=NGrad,IF(D789=0,0,MATCH(C789,'Graduate Preferences'!B790:ZZ790,0)),\"\")","v":""},"","","",null,null,null,""]
[787,{"$f":"IF(A790<=NGrad,'Graduate Preferences'!A791,\"\")","v":""},{"$f":"IF(A790<=NGrad,Process!A790,\"\")","v":""},{"$f":"IF(A790<=NGrad,COUNTIFS('Graduate Preferences'!B791:ZZ791,C790),\"\")","v":""},{"$f":"IF(A790<=NGrad,IF(D790=0,0,MATCH(C790,'Graduate Preferences'!B791:ZZ791,0)),\"\")","v":""},"","","",null,null,null,""]
[788,{"$f":"IF(A791<=NGrad,'Graduate Preferences'!A792,\"\")","v":""},{"$f":"IF(A791<=NGrad,Process!A791,\"\")","v":""},{"$f":"IF(A791<=NGrad,COUNTIFS('Graduate Preferences'!B792:ZZ792,C791),\"\")","v":""},{"$f":"IF(A791<=NGrad,IF(D791=0,0,MATCH(C791,'Graduate Preferences'!B792:ZZ792,0)),\"\")","v":""},"","","",null,null,null,""]
[789,{"$f":"IF(A792<=NGrad,'Graduate Preferences'!A793,\"\")","v":""},{"$f":"IF(A792<=NGrad,Process!A792,\"\")","v":""},{"$f":"IF(A792<=NGrad,COUNTIFS('Graduate Preferences'!B793:ZZ793,C792),\"\")","v":""},{"$f":"IF(A792<=NGrad,IF(D792=0,0,MATCH(C792,'Graduate Preferences'!B793:ZZ793,0)),\"\")","v":""},"","","",null,null,null,""]
[790,{"$f":"IF(A793<=NGrad,'Graduate Preferences'!A794,\"\")","v":""},{"$f":"IF(A793<=NGrad,Process!A793,\"\")","v":""},{"$f":"IF(A793<=NGrad,COUNTIFS('Graduate Preferences'!B794:ZZ794,C793),\"\")","v":""},{"$f":"IF(A793<=NGrad,IF(D793=0,0,MATCH(C793,'Graduate Preferences'!B794:ZZ794,0)),\"\")","v":""},"","","",null,null,null,""]
[791,{"$f":"IF(A794<=NGrad,'Graduate Preferences'!A795,\"\")","v":""},{"$f":"IF(A794<=NGrad,Process!A794,\"\")","v":""},{"$f":"IF(A794<=NGrad,COUNTIFS('Graduate Preferences'!B795:ZZ795,C794),\"\")","v":""},{"$f":"IF(A794<=NGrad,IF(D794=0,0,MATCH(C794,'Graduate Preferences'!B795:ZZ795,0)),\"\")","v":""},"","","",null,null,null,""]
[792,{"$f":"IF(A795<=NGrad,'Graduate Preferences'!A796,\"\")","v":""},{"$f":"IF(A795<=NGrad,Process!A795,\"\")","v":""},{"$f":"IF(A795<=NGrad,COUNTIFS('Graduate Preferences'!B796:ZZ796,C795),\"\")","v":""},{"$f":"IF(A795<=NGrad,IF(D795=0,0,MATCH(C795,'Graduate Preferences'!B796:ZZ796,0)),\"\")","v":""},"","","",null,null,null,""]
[793,{"$f":"IF(A796<=NGrad,'Graduate Preferences'!A797,\"\")","v":""},{"$f":"IF(A796<=NGrad,Process!A796,\"\")","v":""},{"$f":"IF(A796<=NGrad,COUNTIFS('Graduate Preferences'!B797:ZZ797,C796),\"\")","v":""},{"$f":"IF(A796<=NGrad,IF(D796=0,0,MATCH(C796,'Graduate Preferences'!B797:ZZ797,0)),\"\")","v":""},"","","",null,null,null,""]
[794,{"$f":"IF(A797<=NGrad,'Graduate Preferences'!A798,\"\")","v":""},{"$f":"IF(A797<=NGrad,Process!A797,\"\")","v":""},{"$f":"IF(A797<=NGrad,COUNTIFS('Graduate Preferences'!B798:ZZ798,C797),\"\")","v":""},{"$f":"IF(A797<=NGrad,IF(D797=0,0,MATCH(C797,'Graduate Preferences'!B798:ZZ798,0)),\"\")","v":""},"","","",null,null,null,""]
[795,{"$f":"IF(A798<=NGrad,'Graduate Preferences'!A799,\"\")","v":""},{"$f":"IF(A798<=NGrad,Process!A798,\"\")","v":""},{"$f":"IF(A798<=NGrad,COUNTIFS('Graduate Preferences'!B799:ZZ799,C798),\"\")","v":""},{"$f":"IF(A798<=NGrad,IF(D798=0,0,MATCH(C798,'Graduate Preferences'!B799:ZZ799,0)),\"\")","v":""},"","","",null,null,null,""]
[796,{"$f":"IF(A799<=NGrad,'Graduate Preferences'!A800,\"\")","v":""},{"$f":"IF(A799<=NGrad,Process!A799,\"\")","v":""},{"$f":"IF(A799<=NGrad,COUNTIFS('Graduate Preferences'!B800:ZZ800,C799),\"\")","v":""},{"$f":"IF(A799<=NGrad,IF(D799=0,0,MATCH(C799,'Graduate Preferences'!B800:ZZ800,0)),\"\")","v":""},"","","",null,null,null,""]
[797,{"$f":"IF(A800<=NGrad,'Graduate Preferences'!A801,\"\")","v":""},{"$f":"IF(A800<=NGrad,Process!A800,\"\")","v":""},{"$f":"IF(A800<=NGrad,COUNTIFS('Graduate Preferences'!B801:ZZ801,C800),\"\")","v":""},{"$f":"IF(A800<=NGrad,IF(D800=0,0,MATCH(C800,'Graduate Preferences'!B801:ZZ801,0)),\"\")","v":""},"","","",null,null,null,""]
[798,{"$f":"IF(A801<=NGrad,'Graduate Preferences'!A802,\"\")","v":""},{"$f":"IF(A801<=NGrad,Process!A801,\"\")","v":""},{"$f":"IF(A801<=NGrad,COUNTIFS('Graduate Preferences'!B802:ZZ802,C801),\"\")","v":""},{"$f":"IF(A801<=NGrad,IF(D801=0,0,MATCH(C801,'Graduate Preferences'!B802:ZZ802,0)),\"\")","v":""},"","","",null,null,null,""]
[799,{"$f":"IF(A802<=NGrad,'Graduate Preferences'!A803,\"\")","v":""},{"$f":"IF(A802<=NGrad,Process!A802,\"\")","v":""},{"$f":"IF(A802<=NGrad,COUNTIFS('Graduate Preferences'!B803:ZZ803,C802),\"\")","v":""},{"$f":"IF(A802<=NGrad,IF(D802=0,0,MATCH(C802,'Graduate Preferences'!B803:ZZ803,0)),\"\")","v":""},"","","",null,null,null,""]
[800,{"$f":"IF(A803<=NGrad,'Graduate Preferences'!A804,\"\")","v":""},{"$f":"IF(A803<=NGrad,Process!A803,\"\")","v":""},{"$f":"IF(A803<=NGrad,COUNTIFS('Graduate Preferences'!B804:ZZ804,C803),\"\")","v":""},{"$f":"IF(A803<=NGrad,IF(D803=0,0,MATCH(C803,'Graduate Preferences'!B804:ZZ804,0)),\"\")","v":""},"","","",null,null,null,""]
[801,{"$f":"IF(A804<=NGrad,'Graduate Preferences'!A805,\"\")","v":""},{"$f":"IF(A804<=NGrad,Process!A804,\"\")","v":""},{"$f":"IF(A804<=NGrad,COUNTIFS('Graduate Preferences'!B805:ZZ805,C804),\"\")","v":""},{"$f":"IF(A804<=NGrad,IF(D804=0,0,MATCH(C804,'Graduate Preferences'!B805:ZZ805,0)),\"\")","v":""},"","","",null,null,null,""]
[802,{"$f":"IF(A805<=NGrad,'Graduate Preferences'!A806,\"\")","v":""},{"$f":"IF(A805<=NGrad,Process!A805,\"\")","v":""},{"$f":"IF(A805<=NGrad,COUNTIFS('Graduate Preferences'!B806:ZZ806,C805),\"\")","v":""},{"$f":"IF(A805<=NGrad,IF(D805=0,0,MATCH(C805,'Graduate Preferences'!B806:ZZ806,0)),\"\")","v":""},"","","",null,null,null,""]
[803,{"$f":"IF(A806<=NGrad,'Graduate Preferences'!A807,\"\")","v":""},{"$f":"IF(A806<=NGrad,Process!A806,\"\")","v":""},{"$f":"IF(A806<=NGrad,COUNTIFS('Graduate Preferences'!B807:ZZ807,C806),\"\")","v":""},{"$f":"IF(A806<=NGrad,IF(D806=0,0,MATCH(C806,'Graduate Preferences'!B807:ZZ807,0)),\"\")","v":""},"","","",null,null,null,""]
[804,{"$f":"IF(A807<=NGrad,'Graduate Preferences'!A808,\"\")","v":""},{"$f":"IF(A807<=NGrad,Process!A807,\"\")","v":""},{"$f":"IF(A807<=NGrad,COUNTIFS('Graduate Preferences'!B808:ZZ808,C807),\"\")","v":""},{"$f":"IF(A807<=NGrad,IF(D807=0,0,MATCH(C807,'Graduate Preferences'!B808:ZZ808,0)),\"\")","v":""},"","","",null,null,null,""]
[805,{"$f":"IF(A808<=NGrad,'Graduate Preferences'!A809,\"\")","v":""},{"$f":"IF(A808<=NGrad,Process!A808,\"\")","v":""},{"$f":"IF(A808<=NGrad,COUNTIFS('Graduate Preferences'!B809:ZZ809,C808),\"\")","v":""},{"$f":"IF(A808<=NGrad,IF(D808=0,0,MATCH(C808,'Graduate Preferences'!B809:ZZ809,0)),\"\")","v":""},"","","",null,null,null,""]
[806,{"$f":"IF(A809<=NGrad,'Graduate Preferences'!A810,\"\")","v":""},{"$f":"IF(A809<=NGrad,Process!A809,\"\")","v":""},{"$f":"IF(A809<=NGrad,COUNTIFS('Graduate Preferences'!B810:ZZ810,C809),\"\")","v":""},{"$f":"IF(A809<=NGrad,IF(D809=0,0,MATCH(C809,'Graduate Preferences'!B810:ZZ810,0)),\"\")","v":""},"","","",null,null,null,""]
[807,{"$f":"IF(A810<=NGrad,'Graduate Preferences'!A811,\"\")","v":""},{"$f":"IF(A810<=NGrad,Process!A810,\"\")","v":""},{"$f":"IF(A810<=NGrad,COUNTIFS('Graduate Preferences'!B811:ZZ811,C810),\"\")","v":""},{"$f":"IF(A810<=NGrad,IF(D810=0,0,MATCH(C810,'Graduate Preferences'!B811:ZZ811,0)),\"\")","v":""},"","","",null,null,null,""]
[808,{"$f":"IF(A811<=NGrad,'Graduate Preferences'!A812,\"\")","v":""},{"$f":"IF(A811<=NGrad,Process!A811,\"\")","v":""},{"$f":"IF(A811<=NGrad,COUNTIFS('Graduate Preferences'!B812:ZZ812,C811),\"\")","v":""},{"$f":"IF(A811<=NGrad,IF(D811=0,0,MATCH(C811,'Graduate Preferences'!B812:ZZ812,0)),\"\")","v":""},"","","",null,null,null,""]
[809,{"$f":"IF(A812<=NGrad,'Graduate Preferences'!A813,\"\")","v":""},{"$f":"IF(A812<=NGrad,Process!A812,\"\")","v":""},{"$f":"IF(A812<=NGrad,COUNTIFS('Graduate Preferences'!B813:ZZ813,C812),\"\")","v":""},{"$f":"IF(A812<=NGrad,IF(D812=0,0,MATCH(C812,'Graduate Preferences'!B813:ZZ813,0)),\"\")","v":""},"","","",null,null,null,""]
[810,{"$f":"IF(A813<=NGrad,'Graduate Preferences'!A814,\"\")","v":""},{"$f":"IF(A813<=NGrad,Process!A813,\"\")","v":""},{"$f":"IF(A813<=NGrad,COUNTIFS('Graduate Preferences'!B814:ZZ814,C813),\"\")","v":""},{"$f":"IF(A813<=NGrad,IF(D813=0,0,MATCH(C813,'Graduate Preferences'!B814:ZZ814,0)),\"\")","v":""},"","","",null,null,null,""]
[811,{"$f":"IF(A814<=NGrad,'Graduate Preferences'!A815,\"\")","v":""},{"$f":"IF(A814<=NGrad,Process!A814,\"\")","v":""},{"$f":"IF(A814<=NGrad,COUNTIFS('Graduate Preferences'!B815:ZZ815,C814),\"\")","v":""},{"$f":"IF(A814<=NGrad,IF(D814=0,0,MATCH(C814,'Graduate Preferences'!B815:ZZ815,0)),\"\")","v":""},"","","",null,null,null,""]
[812,{"$f":"IF(A815<=NGrad,'Graduate Preferences'!A816,\"\")","v":""},{"$f":"IF(A815<=NGrad,Process!A815,\"\")","v":""},{"$f":"IF(A815<=NGrad,COUNTIFS('Graduate Preferences'!B816:ZZ816,C815),\"\")","v":""},{"$f":"IF(A815<=NGrad,IF(D815=0,0,MATCH(C815,'Graduate Preferences'!B816:ZZ816,0)),\"\")","v":""},"","","",null,null,null,""]
[813,{"$f":"IF(A816<=NGrad,'Graduate Preferences'!A817,\"\")","v":""},{"$f":"IF(A816<=NGrad,Process!A816,\"\")","v":""},{"$f":"IF(A816<=NGrad,COUNTIFS('Graduate Preferences'!B817:ZZ817,C816),\"\")","v":""},{"$f":"IF(A816<=NGrad,IF(D816=0,0,MATCH(C816,'Graduate Preferences'!B817:ZZ817,0)),\"\")","v":""},"","","",null,null,null,""]
[814,{"$f":"IF(A817<=NGrad,'Graduate Preferences'!A818,\"\")","v":""},{"$f":"IF(A817<=NGrad,Process!A817,\"\")","v":""},{"$f":"IF(A817<=NGrad,COUNTIFS('Graduate Preferences'!B818:ZZ818,C817),\"\")","v":""},{"$f":"IF(A817<=NGrad,IF(D817=0,0,MATCH(C817,'Graduate Preferences'!B818:ZZ818,0)),\"\")","v":""},"","","",null,null,null,""]
[815,{"$f":"IF(A818<=NGrad,'Graduate Preferences'!A819,\"\")","v":""},{"$f":"IF(A818<=NGrad,Process!A818,\"\")","v":""},{"$f":"IF(A818<=NGrad,COUNTIFS('Graduate Preferences'!B819:ZZ819,C818),\"\")","v":""},{"$f":"IF(A818<=NGrad,IF(D818=0,0,MATCH(C818,'Graduate Preferences'!B819:ZZ819,0)),\"\")","v":""},"","","",null,null,null,""]
[816,{"$f":"IF(A819<=NGrad,'Graduate Preferences'!A820,\"\")","v":""},{"$f":"IF(A819<=NGrad,Process!A819,\"\")","v":""},{"$f":"IF(A819<=NGrad,COUNTIFS('Graduate Preferences'!B820:ZZ820,C819),\"\")","v":""},{"$f":"IF(A819<=NGrad,IF(D819=0,0,MATCH(C819,'Graduate Preferences'!B820:ZZ820,0)),\"\")","v":""},"","","",null,null,null,""]
[817,{"$f":"IF(A820<=NGrad,'Graduate Preferences'!A821,\"\")","v":""},{"$f":"IF(A820<=NGrad,Process!A820,\"\")","v":""},{"$f":"IF(A820<=NGrad,COUNTIFS('Graduate Preferences'!B821:ZZ821,C820),\"\")","v":""},{"$f":"IF(A820<=NGrad,IF(D820=0,0,MATCH(C820,'Graduate Preferences'!B821:ZZ821,0)),\"\")","v":""},"","","",null,null,null,""]
[818,{"$f":"IF(A821<=NGrad,'Graduate Preferences'!A822,\"\")","v":""},{"$f":"IF(A821<=NGrad,Process!A821,\"\")","v":""},{"$f":"IF(A821<=NGrad,COUNTIFS('Graduate Preferences'!B822:ZZ822,C821),\"\")","v":""},{"$f":"IF(A821<=NGrad,IF(D821=0,0,MATCH(C821,'Graduate Preferences'!B822:ZZ822,0)),\"\")","v":""},"","","",null,null,null,""]
[819,{"$f":"IF(A822<=NGrad,'Graduate Preferences'!A823,\"\")","v":""},{"$f":"IF(A822<=NGrad,Process!A822,\"\")","v":""},{"$f":"IF(A822<=NGrad,COUNTIFS('Graduate Preferences'!B823:ZZ823,C822),\"\")","v":""},{"$f":"IF(A822<=NGrad,IF(D822=0,0,MATCH(C822,'Graduate Preferences'!B823:ZZ823,0)),\"\")","v":""},"","","",null,null,null,""]
[820,{"$f":"IF(A823<=NGrad,'Graduate Preferences'!A824,\"\")","v":""},{"$f":"IF(A823<=NGrad,Process!A823,\"\")","v":""},{"$f":"IF(A823<=NGrad,COUNTIFS('Graduate Preferences'!B824:ZZ824,C823),\"\")","v":""},{"$f":"IF(A823<=NGrad,IF(D823=0,0,MATCH(C823,'Graduate Preferences'!B824:ZZ824,0)),\"\")","v":""},"","","",null,null,null,""]
[821,{"$f":"IF(A824<=NGrad,'Graduate Preferences'!A825,\"\")","v":""},{"$f":"IF(A824<=NGrad,Process!A824,\"\")","v":""},{"$f":"IF(A824<=NGrad,COUNTIFS('Graduate Preferences'!B825:ZZ825,C824),\"\")","v":""},{"$f":"IF(A824<=NGrad,IF(D824=0,0,MATCH(C824,'Graduate Preferences'!B825:ZZ825,0)),\"\")","v":""},"","","",null,null,null,""]
[822,{"$f":"IF(A825<=NGrad,'Graduate Preferences'!A826,\"\")","v":""},{"$f":"IF(A825<=NGrad,Process!A825,\"\")","v":""},{"$f":"IF(A825<=NGrad,COUNTIFS('Graduate Preferences'!B826:ZZ826,C825),\"\")","v":""},{"$f":"IF(A825<=NGrad,IF(D825=0,0,MATCH(C825,'Graduate Preferences'!B826:ZZ826,0)),\"\")","v":""},"","","",null,null,null,""]
[823,{"$f":"IF(A826<=NGrad,'Graduate Preferences'!A827,\"\")","v":""},{"$f":"IF(A826<=NGrad,Process!A826,\"\")","v":""},{"$f":"IF(A826<=NGrad,COUNTIFS('Graduate Preferences'!B827:ZZ827,C826),\"\")","v":""},{"$f":"IF(A826<=NGrad,IF(D826=0,0,MATCH(C826,'Graduate Preferences'!B827:ZZ827,0)),\"\")","v":""},"","","",null,null,null,""]
[824,{"$f":"IF(A827<=NGrad,'Graduate Preferences'!A828,\"\")","v":""},{"$f":"IF(A827<=NGrad,Process!A827,\"\")","v":""},{"$f":"IF(A827<=NGrad,COUNTIFS('Graduate Preferences'!B828:ZZ828,C827),\"\")","v":""},{"$f":"IF(A827<=NGrad,IF(D827=0,0,MATCH(C827,'Graduate Preferences'!B828:ZZ828,0)),\"\")","v":""},"","","",null,null,null,""]
[825,{"$f":"IF(A828<=NGrad,'Graduate Preferences'!A829,\"\")","v":""},{"$f":"IF(A828<=NGrad,Process!A828,\"\")","v":""},{"$f":"IF(A828<=NGrad,COUNTIFS('Graduate Preferences'!B829:ZZ829,C828),\"\")","v":""},{"$f":"IF(A828<=NGrad,IF(D828=0,0,MATCH(C828,'Graduate Preferences'!B829:ZZ829,0)),\"\")","v":""},"","","",null,null,null,""]
[826,{"$f":"IF(A829<=NGrad,'Graduate Preferences'!A830,\"\")","v":""},{"$f":"IF(A829<=NGrad,Process!A829,\"\")","v":""},{"$f":"IF(A829<=NGrad,COUNTIFS('Graduate Preferences'!B830:ZZ830,C829),\"\")","v":""},{"$f":"IF(A829<=NGrad,IF(D829=0,0,MATCH(C829,'Graduate Preferences'!B830:ZZ830,0)),\"\")","v":""},"","","",null,null,null,""]
[827,{"$f":"IF(A830<=NGrad,'Graduate Preferences'!A831,\"\")","v":""},{"$f":"IF(A830<=NGrad,Process!A830,\"\")","v":""},{"$f":"IF(A830<=NGrad,COUNTIFS('Graduate Preferences'!B831:ZZ831,C830),\"\")","v":""},{"$f":"IF(A830<=NGrad,IF(D830=0,0,MATCH(C830,'Graduate Preferences'!B831:ZZ831,0)),\"\")","v":""},"","","",null,null,null,""]
[828,{"$f":"IF(A831<=NGrad,'Graduate Preferences'!A832,\"\")","v":""},{"$f":"IF(A831<=NGrad,Process!A831,\"\")","v":""},{"$f":"IF(A831<=NGrad,COUNTIFS('Graduate Preferences'!B832:ZZ832,C831),\"\")","v":""},{"$f":"IF(A831<=NGrad,IF(D831=0,0,MATCH(C831,'Graduate Preferences'!B832:ZZ832,0)),\"\")","v":""},"","","",null,null,null,""]
[829,{"$f":"IF(A832<=NGrad,'Graduate Preferences'!A833,\"\")","v":""},{"$f":"IF(A832<=NGrad,Process!A832,\"\")","v":""},{"$f":"IF(A832<=NGrad,COUNTIFS('Graduate Preferences'!B833:ZZ833,C832),\"\")","v":""},{"$f":"IF(A832<=NGrad,IF(D832=0,0,MATCH(C832,'Graduate Preferences'!B833:ZZ833,0)),\"\")","v":""},"","","",null,null,null,""]
[830,{"$f":"IF(A833<=NGrad,'Graduate Preferences'!A834,\"\")","v":""},{"$f":"IF(A833<=NGrad,Process!A833,\"\")","v":""},{"$f":"IF(A833<=NGrad,COUNTIFS('Graduate Preferences'!B834:ZZ834,C833),\"\")","v":""},{"$f":"IF(A833<=NGrad,IF(D833=0,0,MATCH(C833,'Graduate Preferences'!B834:ZZ834,0)),\"\")","v":""},"","","",null,null,null,""]
[831,{"$f":"IF(A834<=NGrad,'Graduate Preferences'!A835,\"\")","v":""},{"$f":"IF(A834<=NGrad,Process!A834,\"\")","v":""},{"$f":"IF(A834<=NGrad,COUNTIFS('Graduate Preferences'!B835:ZZ835,C834),\"\")","v":""},{"$f":"IF(A834<=NGrad,IF(D834=0,0,MATCH(C834,'Graduate Preferences'!B835:ZZ835,0)),\"\")","v":""},"","","",null,null,null,""]
[832,{"$f":"IF(A835<=NGrad,'Graduate Preferences'!A836,\"\")","v":""},{"$f":"IF(A835<=NGrad,Process!A835,\"\")","v":""},{"$f":"IF(A835<=NGrad,COUNTIFS('Graduate Preferences'!B836:ZZ836,C835),\"\")","v":""},{"$f":"IF(A835<=NGrad,IF(D835=0,0,MATCH(C835,'Graduate Preferences'!B836:ZZ836,0)),\"\")","v":""},"","","",null,null,null,""]
[833,{"$f":"IF(A836<=NGrad,'Graduate Preferences'!A837,\"\")","v":""},{"$f":"IF(A836<=NGrad,Process!A836,\"\")","v":""},{"$f":"IF(A836<=NGrad,COUNTIFS('Graduate Preferences'!B837:ZZ837,C836),\"\")","v":""},{"$f":"IF(A836<=NGrad,IF(D836=0,0,MATCH(C836,'Graduate Preferences'!B837:ZZ837,0)),\"\")","v":""},"","","",null,null,null,""]
[834,{"$f":"IF(A837<=NGrad,'Graduate Preferences'!A838,\"\")","v":""},{"$f":"IF(A837<=NGrad,Process!A837,\"\")","v":""},{"$f":"IF(A837<=NGrad,COUNTIFS('Graduate Preferences'!B838:ZZ838,C837),\"\")","v":""},{"$f":"IF(A837<=NGrad,IF(D837=0,0,MATCH(C837,'Graduate Preferences'!B838:ZZ838,0)),\"\")","v":""},"",{"$f":"IF(F837=\"\",\"\",RANK(F837,F$4:F$1000))","v":""},"",null,null,null,{"$f":"IF(MAX(H$4:H$1000)>=A837,MATCH(A837,H$4:H$1000,0),\"\")","v":""}]
[835,{"$f":"IF(A838<=NGrad,'Graduate Preferences'!A839,\"\")","v":""},{"$f":"IF(A838<=NGrad,Process!A838,\"\")","v":""},{"$f":"IF(A838<=NGrad,COUNTIFS('Graduate Preferences'!B839:ZZ839,C838),\"\")","v":""},{"$f":"IF(A838<=NGrad,IF(D838=0,0,MATCH(C838,'Graduate Preferences'!B839:ZZ839,0)),\"\")","v":""},{"$f":"IF(AND(J838<>\"-\",J838>0,I838=F$2),J838,\"\")","v":""},"",{"$f":"IF(F838=\"\",\"\",MAX(G$4:G$1000)-G838+1)","v":""},null,null,null,""]
[836,{"$f":"IF(A839<=NGrad,'Graduate Preferences'!A840,\"\")","v":""},{"$f":"IF(A839<=NGrad,Process!A839,\"\")","v":""},{"$f":"IF(A839<=NGrad,COUNTIFS('Graduate Preferences'!B840:ZZ840,C839),\"\")","v":""},{"$f":"IF(A839<=NGrad,IF(D839=0,0,MATCH(C839,'Graduate Preferences'!B840:ZZ840,0)),\"\")","v":""},"","","",null,null,null,""]
[837,{"$f":"IF(A840<=NGrad,'Graduate Preferences'!A841,\"\")","v":""},{"$f":"IF(A840<=NGrad,Process!A840,\"\")","v":""},{"$f":"IF(A840<=NGrad,COUNTIFS('Graduate Preferences'!B841:ZZ841,C840),\"\")","v":""},{"$f":"IF(A840<=NGrad,IF(D840=0,0,MATCH(C840,'Graduate Preferences'!B841:ZZ841,0)),\"\")","v":""},"","","",null,null,null,""]
[838,{"$f":"IF(A841<=NGrad,'Graduate Preferences'!A842,\"\")","v":""},{"$f":"IF(A841<=NGrad,Process!A841,\"\")","v":""},{"$f":"IF(A841<=NGrad,COUNTIFS('Graduate Preferences'!B842:ZZ842,C841),\"\")","v":""},{"$f":"IF(A841<=NGrad,IF(D841=0,0,MATCH(C841,'Graduate Preferences'!B842:ZZ842,0)),\"\")","v":""},"","","",null,null,null,""]
[839,{"$f":"IF(A842<=NGrad,'Graduate Preferences'!A843,\"\")","v":""},{"$f":"IF(A842<=NGrad,Process!A842,\"\")","v":""},{"$f":"IF(A842<=NGrad,COUNTIFS('Graduate Preferences'!B843:ZZ843,C842),\"\")","v":""},{"$f":"IF(A842<=NGrad,IF(D842=0,0,MATCH(C842,'Graduate Preferences'!B843:ZZ843,0)),\"\")","v":""},"","","",null,null,null,""]
[840,{"$f":"IF(A843<=NGrad,'Graduate Preferences'!A844,\"\")","v":""},{"$f":"IF(A843<=NGrad,Process!A843,\"\")","v":""},{"$f":"IF(A843<=NGrad,COUNTIFS('Graduate Preferences'!B844:ZZ844,C843),\"\")","v":""},{"$f":"IF(A843<=NGrad,IF(D843=0,0,MATCH(C843,'Graduate Preferences'!B844:ZZ844,0)),\"\")","v":""},"","","",null,null,null,""]
[841,{"$f":"IF(A844<=NGrad,'Graduate Preferences'!A845,\"\")","v":""},{"$f":"IF(A844<=NGrad,Process!A844,\"\")","v":""},{"$f":"IF(A844<=NGrad,COUNTIFS('Graduate Preferences'!B845:ZZ845,C844),\"\")","v":""},{"$f":"IF(A844<=NGrad,IF(D844=0,0,MATCH(C844,'Graduate Preferences'!B845:ZZ845,0)),\"\")","v":""},"","","",null,null,null,""]
[842,{"$f":"IF(A845<=NGrad,'Graduate Preferences'!A846,\"\")","v":""},{"$f":"IF(A845<=NGrad,Process!A845,\"\")","v":""},{"$f":"IF(A845<=NGrad,COUNTIFS('Graduate Preferences'!B846:ZZ846,C845),\"\")","v":""},{"$f":"IF(A845<=NGrad,IF(D845=0,0,MATCH(C845,'Graduate Preferences'!B846:ZZ846,0)),\"\")","v":""},"","","",null,null,null,""]
[843,{"$f":"IF(A846<=NGrad,'Graduate Preferences'!A847,\"\")","v":""},{"$f":"IF(A846<=NGrad,Process!A846,\"\")","v":""},{"$f":"IF(A846<=NGrad,COUNTIFS('Graduate Preferences'!B847:ZZ847,C846),\"\")","v":""},{"$f":"IF(A846<=NGrad,IF(D846=0,0,MATCH(C846,'Graduate Preferences'!B847:ZZ847,0)),\"\")","v":""},"","","",null,null,null,""]
[844,{"$f":"IF(A847<=NGrad,'Graduate Preferences'!A848,\"\")","v":""},{"$f":"IF(A847<=NGrad,Process!A847,\"\")","v":""},{"$f":"IF(A847<=NGrad,COUNTIFS('Graduate Preferences'!B848:ZZ848,C847),\"\")","v":""},{"$f":"IF(A847<=NGrad,IF(D847=0,0,MATCH(C847,'Graduate Preferences'!B848:ZZ848,0)),\"\")","v":""},"","","",null,null,null,""]
[845,{"$f":"IF(A848<=NGrad,'Graduate Preferences'!A849,\"\")","v":""},{"$f":"IF(A848<=NGrad,Process!A848,\"\")","v":""},{"$f":"IF(A848<=NGrad,COUNTIFS('Graduate Preferences'!B849:ZZ849,C848),\"\")","v":""},{"$f":"IF(A848<=NGrad,IF(D848=0,0,MATCH(C848,'Graduate Preferences'!B849:ZZ849,0)),\"\")","v":""},"","","",null,null,null,""]
[846,{"$f":"IF(A849<=NGrad,'Graduate Preferences'!A850,\"\")","v":""},{"$f":"IF(A849<=NGrad,Process!A849,\"\")","v":""},{"$f":"IF(A849<=NGrad,COUNTIFS('Graduate Preferences'!B850:ZZ850,C849),\"\")","v":""},{"$f":"IF(A849<=NGrad,IF(D849=0,0,MATCH(C849,'Graduate Preferences'!B850:ZZ850,0)),\"\")","v":""},"","","",null,null,null,""]
[847,{"$f":"IF(A850<=NGrad,'Graduate Preferences'!A851,\"\")","v":""},{"$f":"IF(A850<=NGrad,Process!A850,\"\")","v":""},{"$f":"IF(A850<=NGrad,COUNTIFS('Graduate Preferences'!B851:ZZ851,C850),\"\")","v":""},{"$f":"IF(A850<=NGrad,IF(D850=0,0,MATCH(C850,'Graduate Preferences'!B851:ZZ851,0)),\"\")","v":""},"","","",null,null,null,""]
[848,{"$f":"IF(A851<=NGrad,'Graduate Preferences'!A852,\"\")","v":""},{"$f":"IF(A851<=NGrad,Process!A851,\"\")","v":""},{"$f":"IF(A851<=NGrad,COUNTIFS('Graduate Preferences'!B852:ZZ852,C851),\"\")","v":""},{"$f":"IF(A851<=NGrad,IF(D851=0,0,MATCH(C851,'Graduate Preferences'!B852:ZZ852,0)),\"\")","v":""},"","","",null,null,null,""]
[849,{"$f":"IF(A852<=NGrad,'Graduate Preferences'!A853,\"\")","v":""},{"$f":"IF(A852<=NGrad,Process!A852,\"\")","v":""},{"$f":"IF(A852<=NGrad,COUNTIFS('Graduate Preferences'!B853:ZZ853,C852),\"\")","v":""},{"$f":"IF(A852<=NGrad,IF(D852=0,0,MATCH(C852,'Graduate Preferences'!B853:ZZ853,0)),\"\")","v":""},"","","",null,null,null,""]
[850,{"$f":"IF(A853<=NGrad,'Graduate Preferences'!A854,\"\")","v":""},{"$f":"IF(A853<=NGrad,Process!A853,\"\")","v":""},{"$f":"IF(A853<=NGrad,COUNTIFS('Graduate Preferences'!B854:ZZ854,C853),\"\")","v":""},{"$f":"IF(A853<=NGrad,IF(D853=0,0,MATCH(C853,'Graduate Preferences'!B854:ZZ854,0)),\"\")","v":""},"","","",null,null,null,""]
[851,{"$f":"IF(A854<=NGrad,'Graduate Preferences'!A855,\"\")","v":""},{"$f":"IF(A854<=NGrad,Process!A854,\"\")","v":""},{"$f":"IF(A854<=NGrad,COUNTIFS('Graduate Preferences'!B855:ZZ855,C854),\"\")","v":""},{"$f":"IF(A854<=NGrad,IF(D854=0,0,MATCH(C854,'Graduate Preferences'!B855:ZZ855,0)),\"\")","v":""},"","","",null,null,null,""]
[852,{"$f":"IF(A855<=NGrad,'Graduate Preferences'!A856,\"\")","v":""},{"$f":"IF(A855<=NGrad,Process!A855,\"\")","v":""},{"$f":"IF(A855<=NGrad,COUNTIFS('Graduate Preferences'!B856:ZZ856,C855),\"\")","v":""},{"$f":"IF(A855<=NGrad,IF(D855=0,0,MATCH(C855,'Graduate Preferences'!B856:ZZ856,0)),\"\")","v":""},"","","",null,null,null,""]
[853,{"$f":"IF(A856<=NGrad,'Graduate Preferences'!A857,\"\")","v":""},{"$f":"IF(A856<=NGrad,Process!A856,\"\")","v":""},{"$f":"IF(A856<=NGrad,COUNTIFS('Graduate Preferences'!B857:ZZ857,C856),\"\")","v":""},{"$f":"IF(A856<=NGrad,IF(D856=0,0,MATCH(C856,'Graduate Preferences'!B857:ZZ857,0)),\"\")","v":""},"","","",null,null,null,""]
[854,{"$f":"IF(A857<=NGrad,'Graduate Preferences'!A858,\"\")","v":""},{"$f":"IF(A857<=NGrad,Process!A857,\"\")","v":""},{"$f":"IF(A857<=NGrad,COUNTIFS('Graduate Preferences'!B858:ZZ858,C857),\"\")","v":""},{"$f":"IF(A857<=NGrad,IF(D857=0,0,MATCH(C857,'Graduate Preferences'!B858:ZZ858,0)),\"\")","v":""},"","","",null,null,null,""]
[855,{"$f":"IF(A858<=NGrad,'Graduate Preferences'!A859,\"\")","v":""},{"$f":"IF(A858<=NGrad,Process!A858,\"\")","v":""},{"$f":"IF(A858<=NGrad,COUNTIFS('Graduate Preferences'!B859:ZZ859,C858),\"\")","v":""},{"$f":"IF(A858<=NGrad,IF(D858=0,0,MATCH(C858,'Graduate Preferences'!B859:ZZ859,0)),\"\")","v":""},"","","",null,null,null,""]
[856,{"$f":"IF(A859<=NGrad,'Graduate Preferences'!A860,\"\")","v":""},{"$f":"IF(A859<=NGrad,Process!A859,\"\")","v":""},{"$f":"IF(A859<=NGrad,COUNTIFS('Graduate Preferences'!B860:ZZ860,C859),\"\")","v":""},{"$f":"IF(A859<=NGrad,IF(D859=0,0,MATCH(C859,'Graduate Preferences'!B860:ZZ860,0)),\"\")","v":""},"","","",null,null,null,""]
[857,{"$f":"IF(A860<=NGrad,'Graduate Preferences'!A861,\"\")","v":""},{"$f":"IF(A860<=NGrad,Process!A860,\"\")","v":""},{"$f":"IF(A860<=NGrad,COUNTIFS('Graduate Preferences'!B861:ZZ861,C860),\"\")","v":""},{"$f":"IF(A860<=NGrad,IF(D860=0,0,MATCH(C860,'Graduate Preferences'!B861:ZZ861,0)),\"\")","v":""},"","","",null,null,null,""]
[858,{"$f":"IF(A861<=NGrad,'Graduate Preferences'!A862,\"\")","v":""},{"$f":"IF(A861<=NGrad,Process!A861,\"\")","v":""},{"$f":"IF(A861<=NGrad,COUNTIFS('Graduate Preferences'!B862:ZZ862,C861),\"\")","v":""},{"$f":"IF(A861<=NGrad,IF(D861=0,0,MATCH(C861,'Graduate Preferences'!B862:ZZ862,0)),\"\")","v":""},"","","",null,null,null,""]
[859,{"$f":"IF(A862<=NGrad,'Graduate Preferences'!A863,\"\")","v":""},{"$f":"IF(A862<=NGrad,Process!A862,\"\")","v":""},{"$f":"IF(A862<=NGrad,COUNTIFS('Graduate Preferences'!B863:ZZ863,C862),\"\")","v":""},{"$f":"IF(A862<=NGrad,IF(D862=0,0,MATCH(C862,'Graduate Preferences'!B863:ZZ863,0)),\"\")","v":""},"","","",null,null,null,""]
[860,{"$f":"IF(A863<=NGrad,'Graduate Preferences'!A864,\"\")","v":""},{"$f":"IF(A863<=NGrad,Process!A863,\"\")","v":""},{"$f":"IF(A863<=NGrad,COUNTIFS('Graduate Preferences'!B864:ZZ864,C863),\"\")","v":""},{"$f":"IF(A863<=NGrad,IF(D863=0,0,MATCH(C863,'Graduate Preferences'!B864:ZZ864,0)),\"\")","v":""},"","","",null,null,null,""]
[861,{"$f":"IF(A864<=NGrad,'Graduate Preferences'!A865,\"\")","v":""},{"$f":"IF(A864<=NGrad,Process!A864,\"\")","v":""},{"$f":"IF(A864<=NGrad,COUNTIFS('Graduate Preferences'!B865:ZZ865,C864),\"\")","v":""},{"$f":"IF(A864<=NGrad,IF(D864=0,0,MATCH(C864,'Graduate Preferences'!B865:ZZ865,0)),\"\")","v":""},"","","",null,null,null,""]
[862,{"$f":"IF(A865<=NGrad,'Graduate Preferences'!A866,\"\")","v":""},{"$f":"IF(A865<=NGrad,Process!A865,\"\")","v":""},{"$f":"IF(A865<=NGrad,COUNTIFS('Graduate Preferences'!B866:ZZ866,C865),\"\")","v":""},{"$f":"IF(A865<=NGrad,IF(D865=0,0,MATCH(C865,'Graduate Preferences'!B866:ZZ866,0)),\"\")","v":""},"","","",null,null,null,""]
[863,{"$f":"IF(A866<=NGrad,'Graduate Preferences'!A867,\"\")","v":""},{"$f":"IF(A866<=NGrad,Process!A866,\"\")","v":""},{"$f":"IF(A866<=NGrad,COUNTIFS('Graduate Preferences'!B867:ZZ867,C866),\"\")","v":""},{"$f":"IF(A866<=NGrad,IF(D866=0,0,MATCH(C866,'Graduate Preferences'!B867:ZZ867,0)),\"\")","v":""},"","","",null,null,null,""]
[864,{"$f":"IF(A867<=NGrad,'Graduate Preferences'!A868,\"\")","v":""},{"$f":"IF(A867<=NGrad,Process!A867,\"\")","v":""},{"$f":"IF(A867<=NGrad,COUNTIFS('Graduate Preferences'!B868:ZZ868,C867),\"\")","v":""},{"$f":"IF(A867<=NGrad,IF(D867=0,0,MATCH(C867,'Graduate Preferences'!B868:ZZ868,0)),\"\")","v":""},"","","",null,null,null,""]
[865,{"$f":"IF(A868<=NGrad,'Graduate Preferences'!A869,\"\")","v":""},{"$f":"IF(A868<=NGrad,Process!A868,\"\")","v":""},{"$f":"IF(A868<=NGrad,COUNTIFS('Graduate Preferences'!B869:ZZ869,C868),\"\")","v":""},{"$f":"IF(A868<=NGrad,IF(D868=0,0,MATCH(C868,'Graduate Preferences'!B869:ZZ869,0)),\"\")","v":""},"","","",null,null,null,""]
[866,{"$f":"IF(A869<=NGrad,'Graduate Preferences'!A870,\"\")","v":""},{"$f":"IF(A869<=NGrad,Process!A869,\"\")","v":""},{"$f":"IF(A869<=NGrad,COUNTIFS('Graduate Preferences'!B870:ZZ870,C869),\"\")","v":""},{"$f":"IF(A869<=NGrad,IF(D869=0,0,MATCH(C869,'Graduate Preferences'!B870:ZZ870,0)),\"\")","v":""},"","","",null,null,null,""]
[867,{"$f":"IF(A870<=NGrad,'Graduate Preferences'!A871,\"\")","v":""},{"$f":"IF(A870<=NGrad,Process!A870,\"\")","v":""},{"$f":"IF(A870<=NGrad,COUNTIFS('Graduate Preferences'!B871:ZZ871,C870),\"\")","v":""},{"$f":"IF(A870<=NGrad,IF(D870=0,0,MATCH(C870,'Graduate Preferences'!B871:ZZ871,0)),\"\")","v":""},"","","",null,null,null,""]
[868,{"$f":"IF(A871<=NGrad,'Graduate Preferences'!A872,\"\")","v":""},{"$f":"IF(A871<=NGrad,Process!A871,\"\")","v":""},{"$f":"IF(A871<=NGrad,COUNTIFS('Graduate Preferences'!B872:ZZ872,C871),\"\")","v":""},{"$f":"IF(A871<=NGrad,IF(D871=0,0,MATCH(C871,'Graduate Preferences'!B872:ZZ872,0)),\"\")","v":""},"","","",null,null,null,""]
[869,{"$f":"IF(A872<=NGrad,'Graduate Preferences'!A873,\"\")","v":""},{"$f":"IF(A872<=NGrad,Process!A872,\"\")","v":""},{"$f":"IF(A872<=NGrad,COUNTIFS('Graduate Preferences'!B873:ZZ873,C872),\"\")","v":""},{"$f":"IF(A872<=NGrad,IF(D872=0,0,MATCH(C872,'Graduate Preferences'!B873:ZZ873,0)),\"\")","v":""},"","","",null,null,null,""]
[870,{"$f":"IF(A873<=NGrad,'Graduate Preferences'!A874,\"\")","v":""},{"$f":"IF(A873<=NGrad,Process!A873,\"\")","v":""},{"$f":"IF(A873<=NGrad,COUNTIFS('Graduate Preferences'!B874:ZZ874,C873),\"\")","v":""},{"$f":"IF(A873<=NGrad,IF(D873=0,0,MATCH(C873,'Graduate Preferences'!B874:ZZ874,0)),\"\")","v":""},"","","",null,null,null,""]
[871,{"$f":"IF(A874<=NGrad,'Graduate Preferences'!A875,\"\")","v":""},{"$f":"IF(A874<=NGrad,Process!A874,\"\")","v":""},{"$f":"IF(A874<=NGrad,COUNTIFS('Graduate Preferences'!B875:ZZ875,C874),\"\")","v":""},{"$f":"IF(A874<=NGrad,IF(D874=0,0,MATCH(C874,'Graduate Preferences'!B875:ZZ875,0)),\"\")","v":""},"","","",null,null,null,""]
[872,{"$f":"IF(A875<=NGrad,'Graduate Preferences'!A876,\"\")","v":""},{"$f":"IF(A875<=NGrad,Process!A875,\"\")","v":""},{"$f":"IF(A875<=NGrad,COUNTIFS('Graduate Preferences'!B876:ZZ876,C875),\"\")","v":""},{"$f":"IF(A875<=NGrad,IF(D875=0,0,MATCH(C875,'Graduate Preferences'!B876:ZZ876,0)),\"\")","v":""},"","","",null,null,null,""]
[873,{"$f":"IF(A876<=NGrad,'Graduate Preferences'!A877,\"\")","v":""},{"$f":"IF(A876<=NGrad,Process!A876,\"\")","v":""},{"$f":"IF(A876<=NGrad,COUNTIFS('Graduate Preferences'!B877:ZZ877,C876),\"\")","v":""},{"$f":"IF(A876<=NGrad,IF(D876=0,0,MATCH(C876,'Graduate Preferences'!B877:ZZ877,0)),\"\")","v":""},"","","",null,null,null,""]
[874,{"$f":"IF(A877<=NGrad,'Graduate Preferences'!A878,\"\")","v":""},{"$f":"IF(A877<=NGrad,Process!A877,\"\")","v":""},{"$f":"IF(A877<=NGrad,COUNTIFS('Graduate Preferences'!B878:ZZ878,C877),\"\")","v":""},{"$f":"IF(A877<=NGrad,IF(D877=0,0,MATCH(C877,'Graduate Preferences'!B878:ZZ878,0)),\"\")","v":""},"","","",null,null,null,""]
[875,{"$f":"IF(A878<=NGrad,'Graduate Preferences'!A879,\"\")","v":""},{"$f":"IF(A878<=NGrad,Process!A878,\"\")","v":""},{"$f":"IF(A878<=NGrad,COUNTIFS('Graduate Preferences'!B879:ZZ879,C878),\"\")","v":""},{"$f":"IF(A878<=NGrad,IF(D878=0,0,MATCH(C878,'Graduate Preferences'!B879:ZZ879,0)),\"\")","v":""},"","","",null,null,null,""]
[876,{"$f":"IF(A879<=NGrad,'Graduate Preferences'!A880,\"\")","v":""},{"$f":"IF(A879<=NGrad,Process!A879,\"\")","v":""},{"$f":"IF(A879<=NGrad,COUNTIFS('Graduate Preferences'!B880:ZZ880,C879),\"\")","v":""},{"$f":"IF(A879<=NGrad,IF(D879=0,0,MATCH(C879,'Graduate Preferences'!B880:ZZ880,0)),\"\")","v":""},"","","",null,null,null,""]
[877,{"$f":"IF(A880<=NGrad,'Graduate Preferences'!A881,\"\")","v":""},{"$f":"IF(A880<=NGrad,Process!A880,\"\")","v":""},{"$f":"IF(A880<=NGrad,COUNTIFS('Graduate Preferences'!B881:ZZ881,C880),\"\")","v":""},{"$f":"IF(A880<=NGrad,IF(D880=0,0,MATCH(C880,'Graduate Preferences'!B881:ZZ881,0)),\"\")","v":""},"","","",null,null,null,""]
[878,{"$f":"IF(A881<=NGrad,'Graduate Preferences'!A882,\"\")","v":""},{"$f":"IF(A881<=NGrad,Process!A881,\"\")","v":""},{"$f":"IF(A881<=NGrad,COUNTIFS('Graduate Preferences'!B882:ZZ882,C881),\"\")","v":""},{"$f":"IF(A881<=NGrad,IF(D881=0,0,MATCH(C881,'Graduate Preferences'!B882:ZZ882,0)),\"\")","v":""},"","","",null,null,null,""]
[879,{"$f":"IF(A882<=NGrad,'Graduate Preferences'!A883,\"\")","v":""},{"$f":"IF(A882<=NGrad,Process!A882,\"\")","v":""},{"$f":"IF(A882<=NGrad,COUNTIFS('Graduate Preferences'!B883:ZZ883,C882),\"\")","v":""},{"$f":"IF(A882<=NGrad,IF(D882=0,0,MATCH(C882,'Graduate Preferences'!B883:ZZ883,0)),\"\")","v":""},"","","",null,null,null,""]
[880,{"$f":"IF(A883<=NGrad,'Graduate Preferences'!A884,\"\")","v":""},{"$f":"IF(A883<=NGrad,Process!A883,\"\")","v":""},{"$f":"IF(A883<=NGrad,COUNTIFS('Graduate Preferences'!B884:ZZ884,C883),\"\")","v":""},{"$f":"IF(A883<=NGrad,IF(D883=0,0,MATCH(C883,'Graduate Preferences'!B884:ZZ884,0)),\"\")","v":""},"","","",null,null,null,""]
[881,{"$f":"IF(A884<=NGrad,'Graduate Preferences'!A885,\"\")","v":""},{"$f":"IF(A884<=NGrad,Process!A884,\"\")","v":""},{"$f":"IF(A884<=NGrad,COUNTIFS('Graduate Preferences'!B885:ZZ885,C884),\"\")","v":""},{"$f":"IF(A884<=NGrad,IF(D884=0,0,MATCH(C884,'Graduate Preferences'!B885:ZZ885,0)),\"\")","v":""},"","","",null,null,null,""]
[882,{"$f":"IF(A885<=NGrad,'Graduate Preferences'!A886,\"\")","v":""},{"$f":"IF(A885<=NGrad,Process!A885,\"\")","v":""},{"$f":"IF(A885<=NGrad,COUNTIFS('Graduate Preferences'!B886:ZZ886,C885),\"\")","v":""},{"$f":"IF(A885<=NGrad,IF(D885=0,0,MATCH(C885,'Graduate Preferences'!B886:ZZ886,0)),\"\")","v":""},"","","",null,null,null,""]
[883,{"$f":"IF(A886<=NGrad,'Graduate Preferences'!A887,\"\")","v":""},{"$f":"IF(A886<=NGrad,Process!A886,\"\")","v":""},{"$f":"IF(A886<=NGrad,COUNTIFS('Graduate Preferences'!B887:ZZ887,C886),\"\")","v":""},{"$f":"IF(A886<=NGrad,IF(D886=0,0,MATCH(C886,'Graduate Preferences'!B887:ZZ887,0)),\"\")","v":""},"","","",null,null,null,""]
[884,{"$f":"IF(A887<=NGrad,'Graduate Preferences'!A888,\"\")","v":""},{"$f":"IF(A887<=NGrad,Process!A887,\"\")","v":""},{"$f":"IF(A887<=NGrad,COUNTIFS('Graduate Preferences'!B888:ZZ888,C887),\"\")","v":""},{"$f":"IF(A887<=NGrad,IF(D887=0,0,MATCH(C887,'Graduate Preferences'!B888:ZZ888,0)),\"\")","v":""},"","","",null,null,null,""]
[885,{"$f":"IF(A888<=NGrad,'Graduate Preferences'!A889,\"\")","v":""},{"$f":"IF(A888<=NGrad,Process!A888,\"\")","v":""},{"$f":"IF(A888<=NGrad,COUNTIFS('Graduate Preferences'!B889:ZZ889,C888),\"\")","v":""},{"$f":"IF(A888<=NGrad,IF(D888=0,0,MATCH(C888,'Graduate Preferences'!B889:ZZ889,0)),\"\")","v":""},"","","",null,null,null,""]
[886,{"$f":"IF(A889<=NGrad,'Graduate Preferences'!A890,\"\")","v":""},{"$f":"IF(A889<=NGrad,Process!A889,\"\")","v":""},{"$f":"IF(A889<=NGrad,COUNTIFS('Graduate Preferences'!B890:ZZ890,C889),\"\")","v":""},{"$f":"IF(A889<=NGrad,IF(D889=0,0,MATCH(C889,'Graduate Preferences'!B890:ZZ890,0)),\"\")","v":""},"","","",null,null,null,""]
[887,{"$f":"IF(A890<=NGrad,'Graduate Preferences'!A891,\"\")","v":""},{"$f":"IF(A890<=NGrad,Process!A890,\"\")","v":""},{"$f":"IF(A890<=NGrad,COUNTIFS('Graduate Preferences'!B891:ZZ891,C890),\"\")","v":""},{"$f":"IF(A890<=NGrad,IF(D890=0,0,MATCH(C890,'Graduate Preferences'!B891:ZZ891,0)),\"\")","v":""},"","","",null,null,null,""]
[888,{"$f":"IF(A891<=NGrad,'Graduate Preferences'!A892,\"\")","v":""},{"$f":"IF(A891<=NGrad,Process!A891,\"\")","v":""},{"$f":"IF(A891<=NGrad,COUNTIFS('Graduate Preferences'!B892:ZZ892,C891),\"\")","v":""},{"$f":"IF(A891<=NGrad,IF(D891=0,0,MATCH(C891,'Graduate Preferences'!B892:ZZ892,0)),\"\")","v":""},"","","",null,null,null,""]
[889,{"$f":"IF(A892<=NGrad,'Graduate Preferences'!A893,\"\")","v":""},{"$f":"IF(A892<=NGrad,Process!A892,\"\")","v":""},{"$f":"IF(A892<=NGrad,COUNTIFS('Graduate Preferences'!B893:ZZ893,C892),\"\")","v":""},{"$f":"IF(A892<=NGrad,IF(D892=0,0,MATCH(C892,'Graduate Preferences'!B893:ZZ893,0)),\"\")","v":""},"","","",null,null,null,""]
[890,{"$f":"IF(A893<=NGrad,'Graduate Preferences'!A894,\"\")","v":""},{"$f":"IF(A893<=NGrad,Process!A893,\"\")","v":""},{"$f":"IF(A893<=NGrad,COUNTIFS('Graduate Preferences'!B894:ZZ894,C893),\"\")","v":""},{"$f":"IF(A893<=NGrad,IF(D893=0,0,MATCH(C893,'Graduate Preferences'!B894:ZZ894,0)),\"\")","v":""},"","","",null,null,null,""]
[891,{"$f":"IF(A894<=NGrad,'Graduate Preferences'!A895,\"\")","v":""},{"$f":"IF(A894<=NGrad,Process!A894,\"\")","v":""},{"$f":"IF(A894<=NGrad,COUNTIFS('Graduate Preferences'!B895:ZZ895,C894),\"\")","v":""},{"$f":"IF(A894<=NGrad,IF(D894=0,0,MATCH(C894,'Graduate Preferences'!B895:ZZ895,0)),\"\")","v":""},"","","",null,null,null,""]
[892,{"$f":"IF(A895<=NGrad,'Graduate Preferences'!A896,\"\")","v":""},{"$f":"IF(A895<=NGrad,Process!A895,\"\")","v":""},{"$f":"IF(A895<=NGrad,COUNTIFS('Graduate Preferences'!B896:ZZ896,C895),\"\")","v":""},{"$f":"IF(A895<=NGrad,IF(D895=0,0,MATCH(C895,'Graduate Preferences'!B896:ZZ896,0)),\"\")","v":""},"","","",null,null,null,""]
[893,{"$f":"IF(A896<=NGrad,'Graduate Preferences'!A897,\"\")","v":""},{"$f":"IF(A896<=NGrad,Process!A896,\"\")","v":""},{"$f":"IF(A896<=NGrad,COUNTIFS('Graduate Preferences'!B897:ZZ897,C896),\"\")","v":""},{"$f":"IF(A896<=NGrad,IF(D896=0,0,MATCH(C896,'Graduate Preferences'!B897:ZZ897,0)),\"\")","v":""},"","","",null,null,null,""]
[894,{"$f":"IF(A897<=NGrad,'Graduate Preferences'!A898,\"\")","v":""},{"$f":"IF(A897<=NGrad,Process!A897,\"\")","v":""},{"$f":"IF(A897<=NGrad,COUNTIFS('Graduate Preferences'!B898:ZZ898,C897),\"\")","v":""},{"$f":"IF(A897<=NGrad,IF(D897=0,0,MATCH(C897,'Graduate Preferences'!B898:ZZ898,0)),\"\")","v":""},"","","",null,null,null,""]
[895,{"$f":"IF(A898<=NGrad,'Graduate Preferences'!A899,\"\")","v":""},{"$f":"IF(A898<=NGrad,Process!A898,\"\")","v":""},{"$f":"IF(A898<=NGrad,COUNTIFS('Graduate Preferences'!B899:ZZ899,C898),\"\")","v":""},{"$f":"IF(A898<=NGrad,IF(D898=0,0,MATCH(C898,'Graduate Preferences'!B899:ZZ899,0)),\"\")","v":""},"","","",null,null,null,""]
[896,{"$f":"IF(A899<=NGrad,'Graduate Preferences'!A900,\"\")","v":""},{"$f":"IF(A899<=NGrad,Process!A899,\"\")","v":""},{"$f":"IF(A899<=NGrad,COUNTIFS('Graduate Preferences'!B900:ZZ900,C899),\"\")","v":""},{"$f":"IF(A899<=NGrad,IF(D899=0,0,MATCH(C899,'Graduate Preferences'!B900:ZZ900,0)),\"\")","v":""},"","","",null,null,null,""]
[897,{"$f":"IF(A900<=NGrad,'Graduate Preferences'!A901,\"\")","v":""},{"$f":"IF(A900<=NGrad,Process!A900,\"\")","v":""},{"$f":"IF(A900<=NGrad,COUNTIFS('Graduate Preferences'!B901:ZZ901,C900),\"\")","v":""},{"$f":"IF(A900<=NGrad,IF(D900=0,0,MATCH(C900,'Graduate Preferences'!B901:ZZ901,0)),\"\")","v":""},"","","",null,null,null,""]
[898,{"$f":"IF(A901<=NGrad,'Graduate Preferences'!A902,\"\")","v":""},{"$f":"IF(A901<=NGrad,Process!A901,\"\")","v":""},{"$f":"IF(A901<=NGrad,COUNTIFS('Graduate Preferences'!B902:ZZ902,C901),\"\")","v":""},{"$f":"IF(A901<=NGrad,IF(D901=0,0,MATCH(C901,'Graduate Preferences'!B902:ZZ902,0)),\"\")","v":""},"",{"$f":"IF(F901=\"\",\"\",RANK(F901,F$4:F$1000))","v":""},"",null,null,null,{"$f":"IF(MAX(H$4:H$1000)>=A901,MATCH(A901,H$4:H$1000,0),\"\")","v":""}]
[899,{"$f":"IF(A902<=NGrad,'Graduate Preferences'!A903,\"\")","v":""},{"$f":"IF(A902<=NGrad,Process!A902,\"\")","v":""},{"$f":"IF(A902<=NGrad,COUNTIFS('Graduate Preferences'!B903:ZZ903,C902),\"\")","v":""},{"$f":"IF(A902<=NGrad,IF(D902=0,0,MATCH(C902,'Graduate Preferences'!B903:ZZ903,0)),\"\")","v":""},{"$f":"IF(AND(J902<>\"-\",J902>0,I902=F$2),J902,\"\")","v":""},"",{"$f":"IF(F902=\"\",\"\",MAX(G$4:G$1000)-G902+1)","v":""},null,null,null,""]
[900,{"$f":"IF(A903<=NGrad,'Graduate Preferences'!A904,\"\")","v":""},{"$f":"IF(A903<=NGrad,Process!A903,\"\")","v":""},{"$f":"IF(A903<=NGrad,COUNTIFS('Graduate Preferences'!B904:ZZ904,C903),\"\")","v":""},{"$f":"IF(A903<=NGrad,IF(D903=0,0,MATCH(C903,'Graduate Preferences'!B904:ZZ904,0)),\"\")","v":""},"","","",null,null,null,""]
[901,{"$f":"IF(A904<=NGrad,'Graduate Preferences'!A905,\"\")","v":""},{"$f":"IF(A904<=NGrad,Process!A904,\"\")","v":""},{"$f":"IF(A904<=NGrad,COUNTIFS('Graduate Preferences'!B905:ZZ905,C904),\"\")","v":""},{"$f":"IF(A904<=NGrad,IF(D904=0,0,MATCH(C904,'Graduate Preferences'!B905:ZZ905,0)),\"\")","v":""},"","","",null,null,null,""]
[902,{"$f":"IF(A905<=NGrad,'Graduate Preferences'!A906,\"\")","v":""},{"$f":"IF(A905<=NGrad,Process!A905,\"\")","v":""},{"$f":"IF(A905<=NGrad,COUNTIFS('Graduate Preferences'!B906:ZZ906,C905),\"\")","v":""},{"$f":"IF(A905<=NGrad,IF(D905=0,0,MATCH(C905,'Graduate Preferences'!B906:ZZ906,0)),\"\")","v":""},"","","",null,null,null,""]
[903,{"$f":"IF(A906<=NGrad,'Graduate Preferences'!A907,\"\")","v":""},{"$f":"IF(A906<=NGrad,Process!A906,\"\")","v":""},{"$f":"IF(A906<=NGrad,COUNTIFS('Graduate Preferences'!B907:ZZ907,C906),\"\")","v":""},{"$f":"IF(A906<=NGrad,IF(D906=0,0,MATCH(C906,'Graduate Preferences'!B907:ZZ907,0)),\"\")","v":""},"","","",null,null,null,""]
[904,{"$f":"IF(A907<=NGrad,'Graduate Preferences'!A908,\"\")","v":""},{"$f":"IF(A907<=NGrad,Process!A907,\"\")","v":""},{"$f":"IF(A907<=NGrad,COUNTIFS('Graduate Preferences'!B908:ZZ908,C907),\"\")","v":""},{"$f":"IF(A907<=NGrad,IF(D907=0,0,MATCH(C907,'Graduate Preferences'!B908:ZZ908,0)),\"\")","v":""},"","","",null,null,null,""]
[905,{"$f":"IF(A908<=NGrad,'Graduate Preferences'!A909,\"\")","v":""},{"$f":"IF(A908<=NGrad,Process!A908,\"\")","v":""},{"$f":"IF(A908<=NGrad,COUNTIFS('Graduate Preferences'!B909:ZZ909,C908),\"\")","v":""},{"$f":"IF(A908<=NGrad,IF(D908=0,0,MATCH(C908,'Graduate Preferences'!B909:ZZ909,0)),\"\")","v":""},"","","",null,null,null,""]
[906,{"$f":"IF(A909<=NGrad,'Graduate Preferences'!A910,\"\")","v":""},{"$f":"IF(A909<=NGrad,Process!A909,\"\")","v":""},{"$f":"IF(A909<=NGrad,COUNTIFS('Graduate Preferences'!B910:ZZ910,C909),\"\")","v":""},{"$f":"IF(A909<=NGrad,IF(D909=0,0,MATCH(C909,'Graduate Preferences'!B910:ZZ910,0)),\"\")","v":""},"","","",null,null,null,""]
[907,{"$f":"IF(A910<=NGrad,'Graduate Preferences'!A911,\"\")","v":""},{"$f":"IF(A910<=NGrad,Process!A910,\"\")","v":""},{"$f":"IF(A910<=NGrad,COUNTIFS('Graduate Preferences'!B911:ZZ911,C910),\"\")","v":""},{"$f":"IF(A910<=NGrad,IF(D910=0,0,MATCH(C910,'Graduate Preferences'!B911:ZZ911,0)),\"\")","v":""},"","","",null,null,null,""]
[908,{"$f":"IF(A911<=NGrad,'Graduate Preferences'!A912,\"\")","v":""},{"$f":"IF(A911<=NGrad,Process!A911,\"\")","v":""},{"$f":"IF(A911<=NGrad,COUNTIFS('Graduate Preferences'!B912:ZZ912,C911),\"\")","v":""},{"$f":"IF(A911<=NGrad,IF(D911=0,0,MATCH(C911,'Graduate Preferences'!B912:ZZ912,0)),\"\")","v":""},"","","",null,null,null,""]
[909,{"$f":"IF(A912<=NGrad,'Graduate Preferences'!A913,\"\")","v":""},{"$f":"IF(A912<=NGrad,Process!A912,\"\")","v":""},{"$f":"IF(A912<=NGrad,COUNTIFS('Graduate Preferences'!B913:ZZ913,C912),\"\")","v":""},{"$f":"IF(A912<=NGrad,IF(D912=0,0,MATCH(C912,'Graduate Preferences'!B913:ZZ913,0)),\"\")","v":""},"","","",null,null,null,""]
[910,{"$f":"IF(A913<=NGrad,'Graduate Preferences'!A914,\"\")","v":""},{"$f":"IF(A913<=NGrad,Process!A913,\"\")","v":""},{"$f":"IF(A913<=NGrad,COUNTIFS('Graduate Preferences'!B914:ZZ914,C913),\"\")","v":""},{"$f":"IF(A913<=NGrad,IF(D913=0,0,MATCH(C913,'Graduate Preferences'!B914:ZZ914,0)),\"\")","v":""},"","","",null,null,null,""]
[911,{"$f":"IF(A914<=NGrad,'Graduate Preferences'!A915,\"\")","v":""},{"$f":"IF(A914<=NGrad,Process!A914,\"\")","v":""},{"$f":"IF(A914<=NGrad,COUNTIFS('Graduate Preferences'!B915:ZZ915,C914),\"\")","v":""},{"$f":"IF(A914<=NGrad,IF(D914=0,0,MATCH(C914,'Graduate Preferences'!B915:ZZ915,0)),\"\")","v":""},"","","",null,null,null,""]
[912,{"$f":"IF(A915<=NGrad,'Graduate Preferences'!A916,\"\")","v":""},{"$f":"IF(A915<=NGrad,Process!A915,\"\")","v":""},{"$f":"IF(A915<=NGrad,COUNTIFS('Graduate Preferences'!B916:ZZ916,C915),\"\")","v":""},{"$f":"IF(A915<=NGrad,IF(D915=0,0,MATCH(C915,'Graduate Preferences'!B916:ZZ916,0)),\"\")","v":""},"","","",null,null,null,""]
[913,{"$f":"IF(A916<=NGrad,'Graduate Preferences'!A917,\"\")","v":""},{"$f":"IF(A916<=NGrad,Process!A916,\"\")","v":""},{"$f":"IF(A916<=NGrad,COUNTIFS('Graduate Preferences'!B917:ZZ917,C916),\"\")","v":""},{"$f":"IF(A916<=NGrad,IF(D916=0,0,MATCH(C916,'Graduate Preferences'!B917:ZZ917,0)),\"\")","v":""},"","","",null,null,null,""]
[914,{"$f":"IF(A917<=NGrad,'Graduate Preferences'!A918,\"\")","v":""},{"$f":"IF(A917<=NGrad,Process!A917,\"\")","v":""},{"$f":"IF(A917<=NGrad,COUNTIFS('Graduate Preferences'!B918:ZZ918,C917),\"\")","v":""},{"$f":"IF(A917<=NGrad,IF(D917=0,0,MATCH(C917,'Graduate Preferences'!B918:ZZ918,0)),\"\")","v":""},"","","",null,null,null,""]
[915,{"$f":"IF(A918<=NGrad,'Graduate Preferences'!A919,\"\")","v":""},{"$f":"IF(A918<=NGrad,Process!A918,\"\")","v":""},{"$f":"IF(A918<=NGrad,COUNTIFS('Graduate Preferences'!B919:ZZ919,C918),\"\")","v":""},{"$f":"IF(A918<=NGrad,IF(D918=0,0,MATCH(C918,'Graduate Preferences'!B919:ZZ919,0)),\"\")","v":""},"","","",null,null,null,""]
[916,{"$f":"IF(A919<=NGrad,'Graduate Preferences'!A920,\"\")","v":""},{"$f":"IF(A919<=NGrad,Process!A919,\"\")","v":""},{"$f":"IF(A919<=NGrad,COUNTIFS('Graduate Preferences'!B920:ZZ920,C919),\"\")","v":""},{"$f":"IF(A919<=NGrad,IF(D919=0,0,MATCH(C919,'Graduate Preferences'!B920:ZZ920,0)),\"\")","v":""},"","","",null,null,null,""]
[917,{"$f":"IF(A920<=NGrad,'Graduate Preferences'!A921,\"\")","v":""},{"$f":"IF(A920<=NGrad,Process!A920,\"\")","v":""},{"$f":"IF(A920<=NGrad,COUNTIFS('Graduate Preferences'!B921:ZZ921,C920),\"\")","v":""},{"$f":"IF(A920<=NGrad,IF(D920=0,0,MATCH(C920,'Graduate Preferences'!B921:ZZ921,0)),\"\")","v":""},"","","",null,null,null,""]
[918,{"$f":"IF(A921<=NGrad,'Graduate Preferences'!A922,\"\")","v":""},{"$f":"IF(A921<=NGrad,Process!A921,\"\")","v":""},{"$f":"IF(A921<=NGrad,COUNTIFS('Graduate Preferences'!B922:ZZ922,C921),\"\")","v":""},{"$f":"IF(A921<=NGrad,IF(D921=0,0,MATCH(C921,'Graduate Preferences'!B922:ZZ922,0)),\"\")","v":""},"","","",null,null,null,""]
[919,{"$f":"IF(A922<=NGrad,'Graduate Preferences'!A923,\"\")","v":""},{"$f":"IF(A922<=NGrad,Process!A922,\"\")","v":""},{"$f":"IF(A922<=NGrad,COUNTIFS('Graduate Preferences'!B923:ZZ923,C922),\"\")","v":""},{"$f":"IF(A922<=NGrad,IF(D922=0,0,MATCH(C922,'Graduate Preferences'!B923:ZZ923,0)),\"\")","v":""},"","","",null,null,null,""]
[920,{"$f":"IF(A923<=NGrad,'Graduate Preferences'!A924,\"\")","v":""},{"$f":"IF(A923<=NGrad,Process!A923,\"\")","v":""},{"$f":"IF(A923<=NGrad,COUNTIFS('Graduate Preferences'!B924:ZZ924,C923),\"\")","v":""},{"$f":"IF(A923<=NGrad,IF(D923=0,0,MATCH(C923,'Graduate Preferences'!B924:ZZ924,0)),\"\")","v":""},"","","",null,null,null,""]
[921,{"$f":"IF(A924<=NGrad,'Graduate Preferences'!A925,\"\")","v":""},{"$f":"IF(A924<=NGrad,Process!A924,\"\")","v":""},{"$f":"IF(A924<=NGrad,COUNTIFS('Graduate Preferences'!B925:ZZ925,C924),\"\")","v":""},{"$f":"IF(A924<=NGrad,IF(D924=0,0,MATCH(C924,'Graduate Preferences'!B925:ZZ925,0)),\"\")","v":""},"","","",null,null,null,""]
[922,{"$f":"IF(A925<=NGrad,'Graduate Preferences'!A926,\"\")","v":""},{"$f":"IF(A925<=NGrad,Process!A925,\"\")","v":""},{"$f":"IF(A925<=NGrad,COUNTIFS('Graduate Preferences'!B926:ZZ926,C925),\"\")","v":""},{"$f":"IF(A925<=NGrad,IF(D925=0,0,MATCH(C925,'Graduate Preferences'!B926:ZZ926,0)),\"\")","v":""},"","","",null,null,null,""]
[923,{"$f":"IF(A926<=NGrad,'Graduate Preferences'!A927,\"\")","v":""},{"$f":"IF(A926<=NGrad,Process!A926,\"\")","v":""},{"$f":"IF(A926<=NGrad,COUNTIFS('Graduate Preferences'!B927:ZZ927,C926),\"\")","v":""},{"$f":"IF(A926<=NGrad,IF(D926=0,0,MATCH(C926,'Graduate Preferences'!B927:ZZ927,0)),\"\")","v":""},"","","",null,null,null,""]
[924,{"$f":"IF(A927<=NGrad,'Graduate Preferences'!A928,\"\")","v":""},{"$f":"IF(A927<=NGrad,Process!A927,\"\")","v":""},{"$f":"IF(A927<=NGrad,COUNTIFS('Graduate Preferences'!B928:ZZ928,C927),\"\")","v":""},{"$f":"IF(A927<=NGrad,IF(D927=0,0,MATCH(C927,'Graduate Preferences'!B928:ZZ928,0)),\"\")","v":""},"","","",null,null,null,""]
[925,{"$f":"IF(A928<=NGrad,'Graduate Preferences'!A929,\"\")","v":""},{"$f":"IF(A928<=NGrad,Process!A928,\"\")","v":""},{"$f":"IF(A928<=NGrad,COUNTIFS('Graduate Preferences'!B929:ZZ929,C928),\"\")","v":""},{"$f":"IF(A928<=NGrad,IF(D928=0,0,MATCH(C928,'Graduate Preferences'!B929:ZZ929,0)),\"\")","v":""},"","","",null,null,null,""]
[926,{"$f":"IF(A929<=NGrad,'Graduate Preferences'!A930,\"\")","v":""},{"$f":"IF(A929<=NGrad,Process!A929,\"\")","v":""},{"$f":"IF(A929<=NGrad,COUNTIFS('Graduate Preferences'!B930:ZZ930,C929),\"\")","v":""},{"$f":"IF(A929<=NGrad,IF(D929=0,0,MATCH(C929,'Graduate Preferences'!B930:ZZ930,0)),\"\")","v":""},"","","",null,null,null,""]
[927,{"$f":"IF(A930<=NGrad,'Graduate Preferences'!A931,\"\")","v":""},{"$f":"IF(A930<=NGrad,Process!A930,\"\")","v":""},{"$f":"IF(A930<=NGrad,COUNTIFS('Graduate Preferences'!B931:ZZ931,C930),\"\")","v":""},{"$f":"IF(A930<=NGrad,IF(D930=0,0,MATCH(C930,'Graduate Preferences'!B931:ZZ931,0)),\"\")","v":""},"","","",null,null,null,""]
[928,{"$f":"IF(A931<=NGrad,'Graduate Preferences'!A932,\"\")","v":""},{"$f":"IF(A931<=NGrad,Process!A931,\"\")","v":""},{"$f":"IF(A931<=NGrad,COUNTIFS('Graduate Preferences'!B932:ZZ932,C931),\"\")","v":""},{"$f":"IF(A931<=NGrad,IF(D931=0,0,MATCH(C931,'Graduate Preferences'!B932:ZZ932,0)),\"\")","v":""},"","","",null,null,null,""]
[929,{"$f":"IF(A932<=NGrad,'Graduate Preferences'!A933,\"\")","v":""},{"$f":"IF(A932<=NGrad,Process!A932,\"\")","v":""},{"$f":"IF(A932<=NGrad,COUNTIFS('Graduate Preferences'!B933:ZZ933,C932),\"\")","v":""},{"$f":"IF(A932<=NGrad,IF(D932=0,0,MATCH(C932,'Graduate Preferences'!B933:ZZ933,0)),\"\")","v":""},"","","",null,null,null,""]
[930,{"$f":"IF(A933<=NGrad,'Graduate Preferences'!A934,\"\")","v":""},{"$f":"IF(A933<=NGrad,Process!A933,\"\")","v":""},{"$f":"IF(A933<=NGrad,COUNTIFS('Graduate Preferences'!B934:ZZ934,C933),\"\")","v":""},{"$f":"IF(A933<=NGrad,IF(D933=0,0,MATCH(C933,'Graduate Preferences'!B934:ZZ934,0)),\"\")","v":""},"","","",null,null,null,""]
[931,{"$f":"IF(A934<=NGrad,'Graduate Preferences'!A935,\"\")","v":""},{"$f":"IF(A934<=NGrad,Process!A934,\"\")","v":""},{"$f":"IF(A934<=NGrad,COUNTIFS('Graduate Preferences'!B935:ZZ935,C934),\"\")","v":""},{"$f":"IF(A934<=NGrad,IF(D934=0,0,MATCH(C934,'Graduate Preferences'!B935:ZZ935,0)),\"\")","v":""},"","","",null,null,null,""]
[932,{"$f":"IF(A935<=NGrad,'Graduate Preferences'!A936,\"\")","v":""},{"$f":"IF(A935<=NGrad,Process!A935,\"\")","v":""},{"$f":"IF(A935<=NGrad,COUNTIFS('Graduate Preferences'!B936:ZZ936,C935),\"\")","v":""},{"$f":"IF(A935<=NGrad,IF(D935=0,0,MATCH(C935,'Graduate Preferences'!B936:ZZ936,0)),\"\")","v":""},"","","",null,null,null,""]
[933,{"$f":"IF(A936<=NGrad,'Graduate Preferences'!A937,\"\")","v":""},{"$f":"IF(A936<=NGrad,Process!A936,\"\")","v":""},{"$f":"IF(A936<=NGrad,COUNTIFS('Graduate Preferences'!B937:ZZ937,C936),\"\")","v":""},{"$f":"IF(A936<=NGrad,IF(D936=0,0,MATCH(C936,'Graduate Preferences'!B937:ZZ937,0)),\"\")","v":""},"","","",null,null,null,""]
[934,{"$f":"IF(A937<=NGrad,'Graduate Preferences'!A938,\"\")","v":""},{"$f":"IF(A937<=NGrad,Process!A937,\"\")","v":""},{"$f":"IF(A937<=NGrad,COUNTIFS('Graduate Preferences'!B938:ZZ938,C937),\"\")","v":""},{"$f":"IF(A937<=NGrad,IF(D937=0,0,MATCH(C937,'Graduate Preferences'!B938:ZZ938,0)),\"\")","v":""},"","","",null,null,null,""]
[935,{"$f":"IF(A938<=NGrad,'Graduate Preferences'!A939,\"\")","v":""},{"$f":"IF(A938<=NGrad,Process!A938,\"\")","v":""},{"$f":"IF(A938<=NGrad,COUNTIFS('Graduate Preferences'!B939:ZZ939,C938),\"\")","v":""},{"$f":"IF(A938<=NGrad,IF(D938=0,0,MATCH(C938,'Graduate Preferences'!B939:ZZ939,0)),\"\")","v":""},"","","",null,null,null,""]
[936,{"$f":"IF(A939<=NGrad,'Graduate Preferences'!A940,\"\")","v":""},{"$f":"IF(A939<=NGrad,Process!A939,\"\")","v":""},{"$f":"IF(A939<=NGrad,COUNTIFS('Graduate Preferences'!B940:ZZ940,C939),\"\")","v":""},{"$f":"IF(A939<=NGrad,IF(D939=0,0,MATCH(C939,'Graduate Preferences'!B940:ZZ940,0)),\"\")","v":""},"","","",null,null,null,""]
[937,{"$f":"IF(A940<=NGrad,'Graduate Preferences'!A941,\"\")","v":""},{"$f":"IF(A940<=NGrad,Process!A940,\"\")","v":""},{"$f":"IF(A940<=NGrad,COUNTIFS('Graduate Preferences'!B941:ZZ941,C940),\"\")","v":""},{"$f":"IF(A940<=NGrad,IF(D940=0,0,MATCH(C940,'Graduate Preferences'!B941:ZZ941,0)),\"\")","v":""},"","","",null,null,null,""]
[938,{"$f":"IF(A941<=NGrad,'Graduate Preferences'!A942,\"\")","v":""},{"$f":"IF(A941<=NGrad,Process!A941,\"\")","v":""},{"$f":"IF(A941<=NGrad,COUNTIFS('Graduate Preferences'!B942:ZZ942,C941),\"\")","v":""},{"$f":"IF(A941<=NGrad,IF(D941=0,0,MATCH(C941,'Graduate Preferences'!B942:ZZ942,0)),\"\")","v":""},"","","",null,null,null,""]
[939,{"$f":"IF(A942<=NGrad,'Graduate Preferences'!A943,\"\")","v":""},{"$f":"IF(A942<=NGrad,Process!A942,\"\")","v":""},{"$f":"IF(A942<=NGrad,COUNTIFS('Graduate Preferences'!B943:ZZ943,C942),\"\")","v":""},{"$f":"IF(A942<=NGrad,IF(D942=0,0,MATCH(C942,'Graduate Preferences'!B943:ZZ943,0)),\"\")","v":""},"","","",null,null,null,""]
[940,{"$f":"IF(A943<=NGrad,'Graduate Preferences'!A944,\"\")","v":""},{"$f":"IF(A943<=NGrad,Process!A943,\"\")","v":""},{"$f":"IF(A943<=NGrad,COUNTIFS('Graduate Preferences'!B944:ZZ944,C943),\"\")","v":""},{"$f":"IF(A943<=NGrad,IF(D943=0,0,MATCH(C943,'Graduate Preferences'!B944:ZZ944,0)),\"\")","v":""},"","","",null,null,null,""]
[941,{"$f":"IF(A944<=NGrad,'Graduate Preferences'!A945,\"\")","v":""},{"$f":"IF(A944<=NGrad,Process!A944,\"\")","v":""},{"$f":"IF(A944<=NGrad,COUNTIFS('Graduate Preferences'!B945:ZZ945,C944),\"\")","v":""},{"$f":"IF(A944<=NGrad,IF(D944=0,0,MATCH(C944,'Graduate Preferences'!B945:ZZ945,0)),\"\")","v":""},"","","",null,null,null,""]
[942,{"$f":"IF(A945<=NGrad,'Graduate Preferences'!A946,\"\")","v":""},{"$f":"IF(A945<=NGrad,Process!A945,\"\")","v":""},{"$f":"IF(A945<=NGrad,COUNTIFS('Graduate Preferences'!B946:ZZ946,C945),\"\")","v":""},{"$f":"IF(A945<=NGrad,IF(D945=0,0,MATCH(C945,'Graduate Preferences'!B946:ZZ946,0)),\"\")","v":""},"","","",null,null,null,""]
[943,{"$f":"IF(A946<=NGrad,'Graduate Preferences'!A947,\"\")","v":""},{"$f":"IF(A946<=NGrad,Process!A946,\"\")","v":""},{"$f":"IF(A946<=NGrad,COUNTIFS('Graduate Preferences'!B947:ZZ947,C946),\"\")","v":""},{"$f":"IF(A946<=NGrad,IF(D946=0,0,MATCH(C946,'Graduate Preferences'!B947:ZZ947,0)),\"\")","v":""},"","","",null,null,null,""]
[944,{"$f":"IF(A947<=NGrad,'Graduate Preferences'!A948,\"\")","v":""},{"$f":"IF(A947<=NGrad,Process!A947,\"\")","v":""},{"$f":"IF(A947<=NGrad,COUNTIFS('Graduate Preferences'!B948:ZZ948,C947),\"\")","v":""},{"$f":"IF(A947<=NGrad,IF(D947=0,0,MATCH(C947,'Graduate Preferences'!B948:ZZ948,0)),\"\")","v":""},"","","",null,null,null,""]
[945,{"$f":"IF(A948<=NGrad,'Graduate Preferences'!A949,\"\")","v":""},{"$f":"IF(A948<=NGrad,Process!A948,\"\")","v":""},{"$f":"IF(A948<=NGrad,COUNTIFS('Graduate Preferences'!B949:ZZ949,C948),\"\")","v":""},{"$f":"IF(A948<=NGrad,IF(D948=0,0,MATCH(C948,'Graduate Preferences'!B949:ZZ949,0)),\"\")","v":""},"","","",null,null,null,""]
[946,{"$f":"IF(A949<=NGrad,'Graduate Preferences'!A950,\"\")","v":""},{"$f":"IF(A949<=NGrad,Process!A949,\"\")","v":""},{"$f":"IF(A949<=NGrad,COUNTIFS('Graduate Preferences'!B950:ZZ950,C949),\"\")","v":""},{"$f":"IF(A949<=NGrad,IF(D949=0,0,MATCH(C949,'Graduate Preferences'!B950:ZZ950,0)),\"\")","v":""},"","","",null,null,null,""]
[947,{"$f":"IF(A950<=NGrad,'Graduate Preferences'!A951,\"\")","v":""},{"$f":"IF(A950<=NGrad,Process!A950,\"\")","v":""},{"$f":"IF(A950<=NGrad,COUNTIFS('Graduate Preferences'!B951:ZZ951,C950),\"\")","v":""},{"$f":"IF(A950<=NGrad,IF(D950=0,0,MATCH(C950,'Graduate Preferences'!B951:ZZ951,0)),\"\")","v":""},"","","",null,null,null,""]
[948,{"$f":"IF(A951<=NGrad,'Graduate Preferences'!A952,\"\")","v":""},{"$f":"IF(A951<=NGrad,Process!A951,\"\")","v":""},{"$f":"IF(A951<=NGrad,COUNTIFS('Graduate Preferences'!B952:ZZ952,C951),\"\")","v":""},{"$f":"IF(A951<=NGrad,IF(D951=0,0,MATCH(C951,'Graduate Preferences'!B952:ZZ952,0)),\"\")","v":""},"","","",null,null,null,""]
[949,{"$f":"IF(A952<=NGrad,'Graduate Preferences'!A953,\"\")","v":""},{"$f":"IF(A952<=NGrad,Process!A952,\"\")","v":""},{"$f":"IF(A952<=NGrad,COUNTIFS('Graduate Preferences'!B953:ZZ953,C952),\"\")","v":""},{"$f":"IF(A952<=NGrad,IF(D952=0,0,MATCH(C952,'Graduate Preferences'!B953:ZZ953,0)),\"\")","v":""},"","","",null,null,null,""]
[950,{"$f":"IF(A953<=NGrad,'Graduate Preferences'!A954,\"\")","v":""},{"$f":"IF(A953<=NGrad,Process!A953,\"\")","v":""},{"$f":"IF(A953<=NGrad,COUNTIFS('Graduate Preferences'!B954:ZZ954,C953),\"\")","v":""},{"$f":"IF(A953<=NGrad,IF(D953=0,0,MATCH(C953,'Graduate Preferences'!B954:ZZ954,0)),\"\")","v":""},"","","",null,null,null,""]
[951,{"$f":"IF(A954<=NGrad,'Graduate Preferences'!A955,\"\")","v":""},{"$f":"IF(A954<=NGrad,Process!A954,\"\")","v":""},{"$f":"IF(A954<=NGrad,COUNTIFS('Graduate Preferences'!B955:ZZ955,C954),\"\")","v":""},{"$f":"IF(A954<=NGrad,IF(D954=0,0,MATCH(C954,'Graduate Preferences'!B955:ZZ955,0)),\"\")","v":""},"","","",null,null,null,""]
[952,{"$f":"IF(A955<=NGrad,'Graduate Preferences'!A956,\"\")","v":""},{"$f":"IF(A955<=NGrad,Process!A955,\"\")","v":""},{"$f":"IF(A955<=NGrad,COUNTIFS('Graduate Preferences'!B956:ZZ956,C955),\"\")","v":""},{"$f":"IF(A955<=NGrad,IF(D955=0,0,MATCH(C955,'Graduate Preferences'!B956:ZZ956,0)),\"\")","v":""},"","","",null,null,null,""]
[953,{"$f":"IF(A956<=NGrad,'Graduate Preferences'!A957,\"\")","v":""},{"$f":"IF(A956<=NGrad,Process!A956,\"\")","v":""},{"$f":"IF(A956<=NGrad,COUNTIFS('Graduate Preferences'!B957:ZZ957,C956),\"\")","v":""},{"$f":"IF(A956<=NGrad,IF(D956=0,0,MATCH(C956,'Graduate Preferences'!B957:ZZ957,0)),\"\")","v":""},"","","",null,null,null,""]
[954,{"$f":"IF(A957<=NGrad,'Graduate Preferences'!A958,\"\")","v":""},{"$f":"IF(A957<=NGrad,Process!A957,\"\")","v":""},{"$f":"IF(A957<=NGrad,COUNTIFS('Graduate Preferences'!B958:ZZ958,C957),\"\")","v":""},{"$f":"IF(A957<=NGrad,IF(D957=0,0,MATCH(C957,'Graduate Preferences'!B958:ZZ958,0)),\"\")","v":""},"","","",null,null,null,""]
[955,{"$f":"IF(A958<=NGrad,'Graduate Preferences'!A959,\"\")","v":""},{"$f":"IF(A958<=NGrad,Process!A958,\"\")","v":""},{"$f":"IF(A958<=NGrad,COUNTIFS('Graduate Preferences'!B959:ZZ959,C958),\"\")","v":""},{"$f":"IF(A958<=NGrad,IF(D958=0,0,MATCH(C958,'Graduate Preferences'!B959:ZZ959,0)),\"\")","v":""},"","","",null,null,null,""]
[956,{"$f":"IF(A959<=NGrad,'Graduate Preferences'!A960,\"\")","v":""},{"$f":"IF(A959<=NGrad,Process!A959,\"\")","v":""},{"$f":"IF(A959<=NGrad,COUNTIFS('Graduate Preferences'!B960:ZZ960,C959),\"\")","v":""},{"$f":"IF(A959<=NGrad,IF(D959=0,0,MATCH(C959,'Graduate Preferences'!B960:ZZ960,0)),\"\")","v":""},"","","",null,null,null,""]
[957,{"$f":"IF(A960<=NGrad,'Graduate Preferences'!A961,\"\")","v":""},{"$f":"IF(A960<=NGrad,Process!A960,\"\")","v":""},{"$f":"IF(A960<=NGrad,COUNTIFS('Graduate Preferences'!B961:ZZ961,C960),\"\")","v":""},{"$f":"IF(A960<=NGrad,IF(D960=0,0,MATCH(C960,'Graduate Preferences'!B961:ZZ961,0)),\"\")","v":""},"","","",null,null,null,""]
[958,{"$f":"IF(A961<=NGrad,'Graduate Preferences'!A962,\"\")","v":""},{"$f":"IF(A961<=NGrad,Process!A961,\"\")","v":""},{"$f":"IF(A961<=NGrad,COUNTIFS('Graduate Preferences'!B962:ZZ962,C961),\"\")","v":""},{"$f":"IF(A961<=NGrad,IF(D961=0,0,MATCH(C961,'Graduate Preferences'!B962:ZZ962,0)),\"\")","v":""},"","","",null,null,null,""]
[959,{"$f":"IF(A962<=NGrad,'Graduate Preferences'!A963,\"\")","v":""},{"$f":"IF(A962<=NGrad,Process!A962,\"\")","v":""},{"$f":"IF(A962<=NGrad,COUNTIFS('Graduate Preferences'!B963:ZZ963,C962),\"\")","v":""},{"$f":"IF(A962<=NGrad,IF(D962=0,0,MATCH(C962,'Graduate Preferences'!B963:ZZ963,0)),\"\")","v":""},"","","",null,null,null,""]
[960,{"$f":"IF(A963<=NGrad,'Graduate Preferences'!A964,\"\")","v":""},{"$f":"IF(A963<=NGrad,Process!A963,\"\")","v":""},{"$f":"IF(A963<=NGrad,COUNTIFS('Graduate Preferences'!B964:ZZ964,C963),\"\")","v":""},{"$f":"IF(A963<=NGrad,IF(D963=0,0,MATCH(C963,'Graduate Preferences'!B964:ZZ964,0)),\"\")","v":""},"","","",null,null,null,""]
[961,{"$f":"IF(A964<=NGrad,'Graduate Preferences'!A965,\"\")","v":""},{"$f":"IF(A964<=NGrad,Process!A964,\"\")","v":""},{"$f":"IF(A964<=NGrad,COUNTIFS('Graduate Preferences'!B965:ZZ965,C964),\"\")","v":""},{"$f":"IF(A964<=NGrad,IF(D964=0,0,MATCH(C964,'Graduate Preferences'!B965:ZZ965,0)),\"\")","v":""},"","","",null,null,null,""]
[962,{"$f":"IF(A965<=NGrad,'Graduate Preferences'!A966,\"\")","v":""},{"$f":"IF(A965<=NGrad,Process!A965,\"\")","v":""},{"$f":"IF(A965<=NGrad,COUNTIFS('Graduate Preferences'!B966:ZZ966,C965),\"\")","v":""},{"$f":"IF(A965<=NGrad,IF(D965=0,0,MATCH(C965,'Graduate Preferences'!B966:ZZ966,0)),\"\")","v":""},"",{"$f":"IF(F965=\"\",\"\",RANK(F965,F$4:F$1000))","v":""},"",null,null,null,{"$f":"IF(MAX(H$4:H$1000)>=A965,MATCH(A965,H$4:H$1000,0),\"\")","v":""}]
[963,{"$f":"IF(A966<=NGrad,'Graduate Preferences'!A967,\"\")","v":""},{"$f":"IF(A966<=NGrad,Process!A966,\"\")","v":""},{"$f":"IF(A966<=NGrad,COUNTIFS('Graduate Preferences'!B967:ZZ967,C966),\"\")","v":""},{"$f":"IF(A966<=NGrad,IF(D966=0,0,MATCH(C966,'Graduate Preferences'!B967:ZZ967,0)),\"\")","v":""},{"$f":"IF(AND(J966<>\"-\",J966>0,I966=F$2),J966,\"\")","v":""},"",{"$f":"IF(F966=\"\",\"\",MAX(G$4:G$1000)-G966+1)","v":""},null,null,null,""]
[964,{"$f":"IF(A967<=NGrad,'Graduate Preferences'!A968,\"\")","v":""},{"$f":"IF(A967<=NGrad,Process!A967,\"\")","v":""},{"$f":"IF(A967<=NGrad,COUNTIFS('Graduate Preferences'!B968:ZZ968,C967),\"\")","v":""},{"$f":"IF(A967<=NGrad,IF(D967=0,0,MATCH(C967,'Graduate Preferences'!B968:ZZ968,0)),\"\")","v":""},"","","",null,null,null,""]
[965,{"$f":"IF(A968<=NGrad,'Graduate Preferences'!A969,\"\")","v":""},{"$f":"IF(A968<=NGrad,Process!A968,\"\")","v":""},{"$f":"IF(A968<=NGrad,COUNTIFS('Graduate Preferences'!B969:ZZ969,C968),\"\")","v":""},{"$f":"IF(A968<=NGrad,IF(D968=0,0,MATCH(C968,'Graduate Preferences'!B969:ZZ969,0)),\"\")","v":""},"","","",null,null,null,""]
[966,{"$f":"IF(A969<=NGrad,'Graduate Preferences'!A970,\"\")","v":""},{"$f":"IF(A969<=NGrad,Process!A969,\"\")","v":""},{"$f":"IF(A969<=NGrad,COUNTIFS('Graduate Preferences'!B970:ZZ970,C969),\"\")","v":""},{"$f":"IF(A969<=NGrad,IF(D969=0,0,MATCH(C969,'Graduate Preferences'!B970:ZZ970,0)),\"\")","v":""},"","","",null,null,null,""]
[967,{"$f":"IF(A970<=NGrad,'Graduate Preferences'!A971,\"\")","v":""},{"$f":"IF(A970<=NGrad,Process!A970,\"\")","v":""},{"$f":"IF(A970<=NGrad,COUNTIFS('Graduate Preferences'!B971:ZZ971,C970),\"\")","v":""},{"$f":"IF(A970<=NGrad,IF(D970=0,0,MATCH(C970,'Graduate Preferences'!B971:ZZ971,0)),\"\")","v":""},"","","",null,null,null,""]
[968,{"$f":"IF(A971<=NGrad,'Graduate Preferences'!A972,\"\")","v":""},{"$f":"IF(A971<=NGrad,Process!A971,\"\")","v":""},{"$f":"IF(A971<=NGrad,COUNTIFS('Graduate Preferences'!B972:ZZ972,C971),\"\")","v":""},{"$f":"IF(A971<=NGrad,IF(D971=0,0,MATCH(C971,'Graduate Preferences'!B972:ZZ972,0)),\"\")","v":""},"","","",null,null,null,""]
[969,{"$f":"IF(A972<=NGrad,'Graduate Preferences'!A973,\"\")","v":""},{"$f":"IF(A972<=NGrad,Process!A972,\"\")","v":""},{"$f":"IF(A972<=NGrad,COUNTIFS('Graduate Preferences'!B973:ZZ973,C972),\"\")","v":""},{"$f":"IF(A972<=NGrad,IF(D972=0,0,MATCH(C972,'Graduate Preferences'!B973:ZZ973,0)),\"\")","v":""},"","","",null,null,null,""]
[970,{"$f":"IF(A973<=NGrad,'Graduate Preferences'!A974,\"\")","v":""},{"$f":"IF(A973<=NGrad,Process!A973,\"\")","v":""},{"$f":"IF(A973<=NGrad,COUNTIFS('Graduate Preferences'!B974:ZZ974,C973),\"\")","v":""},{"$f":"IF(A973<=NGrad,IF(D973=0,0,MATCH(C973,'Graduate Preferences'!B974:ZZ974,0)),\"\")","v":""},"","","",null,null,null,""]
[971,{"$f":"IF(A974<=NGrad,'Graduate Preferences'!A975,\"\")","v":""},{"$f":"IF(A974<=NGrad,Process!A974,\"\")","v":""},{"$f":"IF(A974<=NGrad,COUNTIFS('Graduate Preferences'!B975:ZZ975,C974),\"\")","v":""},{"$f":"IF(A974<=NGrad,IF(D974=0,0,MATCH(C974,'Graduate Preferences'!B975:ZZ975,0)),\"\")","v":""},"","","",null,null,null,""]
[972,{"$f":"IF(A975<=NGrad,'Graduate Preferences'!A976,\"\")","v":""},{"$f":"IF(A975<=NGrad,Process!A975,\"\")","v":""},{"$f":"IF(A975<=NGrad,COUNTIFS('Graduate Preferences'!B976:ZZ976,C975),\"\")","v":""},{"$f":"IF(A975<=NGrad,IF(D975=0,0,MATCH(C975,'Graduate Preferences'!B976:ZZ976,0)),\"\")","v":""},"","","",null,null,null,""]
[973,{"$f":"IF(A976<=NGrad,'Graduate Preferences'!A977,\"\")","v":""},{"$f":"IF(A976<=NGrad,Process!A976,\"\")","v":""},{"$f":"IF(A976<=NGrad,COUNTIFS('Graduate Preferences'!B977:ZZ977,C976),\"\")","v":""},{"$f":"IF(A976<=NGrad,IF(D976=0,0,MATCH(C976,'Graduate Preferences'!B977:ZZ977,0)),\"\")","v":""},"","","",null,null,null,""]
[974,{"$f":"IF(A977<=NGrad,'Graduate Preferences'!A978,\"\")","v":""},{"$f":"IF(A977<=NGrad,Process!A977,\"\")","v":""},{"$f":"IF(A977<=NGrad,COUNTIFS('Graduate Preferences'!B978:ZZ978,C977),\"\")","v":""},{"$f":"IF(A977<=NGrad,IF(D977=0,0,MATCH(C977,'Graduate Preferences'!B978:ZZ978,0)),\"\")","v":""},"","","",null,null,null,""]
[975,{"$f":"IF(A978<=NGrad,'Graduate Preferences'!A979,\"\")","v":""},{"$f":"IF(A978<=NGrad,Process!A978,\"\")","v":""},{"$f":"IF(A978<=NGrad,COUNTIFS('Graduate Preferences'!B979:ZZ979,C978),\"\")","v":""},{"$f":"IF(A978<=NGrad,IF(D978=0,0,MATCH(C978,'Graduate Preferences'!B979:ZZ979,0)),\"\")","v":""},"","","",null,null,null,""]
[976,{"$f":"IF(A979<=NGrad,'Graduate Preferences'!A980,\"\")","v":""},{"$f":"IF(A979<=NGrad,Process!A979,\"\")","v":""},{"$f":"IF(A979<=NGrad,COUNTIFS('Graduate Preferences'!B980:ZZ980,C979),\"\")","v":""},{"$f":"IF(A979<=NGrad,IF(D979=0,0,MATCH(C979,'Graduate Preferences'!B980:ZZ980,0)),\"\")","v":""},"","","",null,null,null,""]
[977,{"$f":"IF(A980<=NGrad,'Graduate Preferences'!A981,\"\")","v":""},{"$f":"IF(A980<=NGrad,Process!A980,\"\")","v":""},{"$f":"IF(A980<=NGrad,COUNTIFS('Graduate Preferences'!B981:ZZ981,C980),\"\")","v":""},{"$f":"IF(A980<=NGrad,IF(D980=0,0,MATCH(C980,'Graduate Preferences'!B981:ZZ981,0)),\"\")","v":""},"","","",null,null,null,""]
[978,{"$f":"IF(A981<=NGrad,'Graduate Preferences'!A982,\"\")","v":""},{"$f":"IF(A981<=NGrad,Process!A981,\"\")","v":""},{"$f":"IF(A981<=NGrad,COUNTIFS('Graduate Preferences'!B982:ZZ982,C981),\"\")","v":""},{"$f":"IF(A981<=NGrad,IF(D981=0,0,MATCH(C981,'Graduate Preferences'!B982:ZZ982,0)),\"\")","v":""},"","","",null,null,null,""]
[979,{"$f":"IF(A982<=NGrad,'Graduate Preferences'!A983,\"\")","v":""},{"$f":"IF(A982<=NGrad,Process!A982,\"\")","v":""},{"$f":"IF(A982<=NGrad,COUNTIFS('Graduate Preferences'!B983:ZZ983,C982),\"\")","v":""},{"$f":"IF(A982<=NGrad,IF(D982=0,0,MATCH(C982,'Graduate Preferences'!B983:ZZ983,0)),\"\")","v":""},"","","",null,null,null,""]
[980,{"$f":"IF(A983<=NGrad,'Graduate Preferences'!A984,\"\")","v":""},{"$f":"IF(A983<=NGrad,Process!A983,\"\")","v":""},{"$f":"IF(A983<=NGrad,COUNTIFS('Graduate Preferences'!B984:ZZ984,C983),\"\")","v":""},{"$f":"IF(A983<=NGrad,IF(D983=0,0,MATCH(C983,'Graduate Preferences'!B984:ZZ984,0)),\"\")","v":""},"","","",null,null,null,""]
[981,{"$f":"IF(A984<=NGrad,'Graduate Preferences'!A985,\"\")","v":""},{"$f":"IF(A984<=NGrad,Process!A984,\"\")","v":""},{"$f":"IF(A984<=NGrad,COUNTIFS('Graduate Preferences'!B985:ZZ985,C984),\"\")","v":""},{"$f":"IF(A984<=NGrad,IF(D984=0,0,MATCH(C984,'Graduate Preferences'!B985:ZZ985,0)),\"\")","v":""},"","","",null,null,null,""]
[982,{"$f":"IF(A985<=NGrad,'Graduate Preferences'!A986,\"\")","v":""},{"$f":"IF(A985<=NGrad,Process!A985,\"\")","v":""},{"$f":"IF(A985<=NGrad,COUNTIFS('Graduate Preferences'!B986:ZZ986,C985),\"\")","v":""},{"$f":"IF(A985<=NGrad,IF(D985=0,0,MATCH(C985,'Graduate Preferences'!B986:ZZ986,0)),\"\")","v":""},"","","",null,null,null,""]
[983,{"$f":"IF(A986<=NGrad,'Graduate Preferences'!A987,\"\")","v":""},{"$f":"IF(A986<=NGrad,Process!A986,\"\")","v":""},{"$f":"IF(A986<=NGrad,COUNTIFS('Graduate Preferences'!B987:ZZ987,C986),\"\")","v":""},{"$f":"IF(A986<=NGrad,IF(D986=0,0,MATCH(C986,'Graduate Preferences'!B987:ZZ987,0)),\"\")","v":""},"","","",null,null,null,""]
[984,{"$f":"IF(A987<=NGrad,'Graduate Preferences'!A988,\"\")","v":""},{"$f":"IF(A987<=NGrad,Process!A987,\"\")","v":""},{"$f":"IF(A987<=NGrad,COUNTIFS('Graduate Preferences'!B988:ZZ988,C987),\"\")","v":""},{"$f":"IF(A987<=NGrad,IF(D987=0,0,MATCH(C987,'Graduate Preferences'!B988:ZZ988,0)),\"\")","v":""},"","","",null,null,null,""]
[985,{"$f":"IF(A988<=NGrad,'Graduate Preferences'!A989,\"\")","v":""},{"$f":"IF(A988<=NGrad,Process!A988,\"\")","v":""},{"$f":"IF(A988<=NGrad,COUNTIFS('Graduate Preferences'!B989:ZZ989,C988),\"\")","v":""},{"$f":"IF(A988<=NGrad,IF(D988=0,0,MATCH(C988,'Graduate Preferences'!B989:ZZ989,0)),\"\")","v":""},"","","",null,null,null,""]
[986,{"$f":"IF(A989<=NGrad,'Graduate Preferences'!A990,\"\")","v":""},{"$f":"IF(A989<=NGrad,Process!A989,\"\")","v":""},{"$f":"IF(A989<=NGrad,COUNTIFS('Graduate Preferences'!B990:ZZ990,C989),\"\")","v":""},{"$f":"IF(A989<=NGrad,IF(D989=0,0,MATCH(C989,'Graduate Preferences'!B990:ZZ990,0)),\"\")","v":""},"","","",null,null,null,""]
[987,{"$f":"IF(A990<=NGrad,'Graduate Preferences'!A991,\"\")","v":""},{"$f":"IF(A990<=NGrad,Process!A990,\"\")","v":""},{"$f":"IF(A990<=NGrad,COUNTIFS('Graduate Preferences'!B991:ZZ991,C990),\"\")","v":""},{"$f":"IF(A990<=NGrad,IF(D990=0,0,MATCH(C990,'Graduate Preferences'!B991:ZZ991,0)),\"\")","v":""},"","","",null,null,null,""]
[988,{"$f":"IF(A991<=NGrad,'Graduate Preferences'!A992,\"\")","v":""},{"$f":"IF(A991<=NGrad,Process!A991,\"\")","v":""},{"$f":"IF(A991<=NGrad,COUNTIFS('Graduate Preferences'!B992:ZZ992,C991),\"\")","v":""},{"$f":"IF(A991<=NGrad,IF(D991=0,0,MATCH(C991,'Graduate Preferences'!B992:ZZ992,0)),\"\")","v":""},"","","",null,null,null,""]
[989,{"$f":"IF(A992<=NGrad,'Graduate Preferences'!A993,\"\")","v":""},{"$f":"IF(A992<=NGrad,Process!A992,\"\")","v":""},{"$f":"IF(A992<=NGrad,COUNTIFS('Graduate Preferences'!B993:ZZ993,C992),\"\")","v":""},{"$f":"IF(A992<=NGrad,IF(D992=0,0,MATCH(C992,'Graduate Preferences'!B993:ZZ993,0)),\"\")","v":""},"","","",null,null,null,""]
[990,{"$f":"IF(A993<=NGrad,'Graduate Preferences'!A994,\"\")","v":""},{"$f":"IF(A993<=NGrad,Process!A993,\"\")","v":""},{"$f":"IF(A993<=NGrad,COUNTIFS('Graduate Preferences'!B994:ZZ994,C993),\"\")","v":""},{"$f":"IF(A993<=NGrad,IF(D993=0,0,MATCH(C993,'Graduate Preferences'!B994:ZZ994,0)),\"\")","v":""},"","","",null,null,null,""]
[991,{"$f":"IF(A994<=NGrad,'Graduate Preferences'!A995,\"\")","v":""},{"$f":"IF(A994<=NGrad,Process!A994,\"\")","v":""},{"$f":"IF(A994<=NGrad,COUNTIFS('Graduate Preferences'!B995:ZZ995,C994),\"\")","v":""},{"$f":"IF(A994<=NGrad,IF(D994=0,0,MATCH(C994,'Graduate Preferences'!B995:ZZ995,0)),\"\")","v":""},"","","",null,null,null,""]
[992,{"$f":"IF(A995<=NGrad,'Graduate Preferences'!A996,\"\")","v":""},{"$f":"IF(A995<=NGrad,Process!A995,\"\")","v":""},{"$f":"IF(A995<=NGrad,COUNTIFS('Graduate Preferences'!B996:ZZ996,C995),\"\")","v":""},{"$f":"IF(A995<=NGrad,IF(D995=0,0,MATCH(C995,'Graduate Preferences'!B996:ZZ996,0)),\"\")","v":""},"","","",null,null,null,""]
[993,{"$f":"IF(A996<=NGrad,'Graduate Preferences'!A997,\"\")","v":""},{"$f":"IF(A996<=NGrad,Process!A996,\"\")","v":""},{"$f":"IF(A996<=NGrad,COUNTIFS('Graduate Preferences'!B997:ZZ997,C996),\"\")","v":""},{"$f":"IF(A996<=NGrad,IF(D996=0,0,MATCH(C996,'Graduate Preferences'!B997:ZZ997,0)),\"\")","v":""},"","","",null,null,null,""]
[994,{"$f":"IF(A997<=NGrad,'Graduate Preferences'!A998,\"\")","v":""},{"$f":"IF(A997<=NGrad,Process!A997,\"\")","v":""},{"$f":"IF(A997<=NGrad,COUNTIFS('Graduate Preferences'!B998:ZZ998,C997),\"\")","v":""},{"$f":"IF(A997<=NGrad,IF(D997=0,0,MATCH(C997,'Graduate Preferences'!B998:ZZ998,0)),\"\")","v":""},"","","",null,null,null,""]
[995,{"$f":"IF(A998<=NGrad,'Graduate Preferences'!A999,\"\")","v":""},{"$f":"IF(A998<=NGrad,Process!A998,\"\")","v":""},{"$f":"IF(A998<=NGrad,COUNTIFS('Graduate Preferences'!B999:ZZ999,C998),\"\")","v":""},{"$f":"IF(A998<=NGrad,IF(D998=0,0,MATCH(C998,'Graduate Preferences'!B999:ZZ999,0)),\"\")","v":""},"","","",null,null,null,""]
[996,{"$f":"IF(A999<=NGrad,'Graduate Preferences'!A1000,\"\")","v":""},{"$f":"IF(A999<=NGrad,Process!A999,\"\")","v":""},{"$f":"IF(A999<=NGrad,COUNTIFS('Graduate Preferences'!B1000:ZZ1000,C999),\"\")","v":""},{"$f":"IF(A999<=NGrad,IF(D999=0,0,MATCH(C999,'Graduate Preferences'!B1000:ZZ1000,0)),\"\")","v":""},"","","",null,null,null,""]
[997,{"$f":"IF(A1000<=NGrad,'Graduate Preferences'!A1001,\"\")","v":""},{"$f":"IF(A1000<=NGrad,Process!A1000,\"\")","v":""},{"$f":"IF(A1000<=NGrad,COUNTIFS('Graduate Preferences'!B1001:ZZ1001,C1000),\"\")","v":""},{"$f":"IF(A1000<=NGrad,IF(D1000=0,0,MATCH(C1000,'Graduate Preferences'!B1001:ZZ1001,0)),\"\")","v":""},"","","",null,null,null,""]
[998,{"$f":"IF(A1001<=NGrad,'Graduate Preferences'!A1002,\"\")","v":""},{"$f":"IF(A1001<=NGrad,Process!A1001,\"\")","v":""},{"$f":"IF(A1001<=NGrad,COUNTIFS('Graduate Preferences'!B1002:ZZ1002,C1001),\"\")","v":""},{"$f":"IF(A1001<=NGrad,IF(D1001=0,0,MATCH(C1001,'Graduate Preferences'!B1002:ZZ1002,0)),\"\")","v":""},"","","",null,null,null,""]
[999,{"$f":"IF(A1002<=NGrad,'Graduate Preferences'!A1003,\"\")","v":""},{"$f":"IF(A1002<=NGrad,Process!A1002,\"\")","v":""},{"$f":"IF(A1002<=NGrad,COUNTIFS('Graduate Preferences'!B1003:ZZ1003,C1002),\"\")","v":""},{"$f":"IF(A1002<=NGrad,IF(D1002=0,0,MATCH(C1002,'Graduate Preferences'!B1003:ZZ1003,0)),\"\")","v":""},"","","",null,null,null,""]
[1000,{"$f":"IF(A1003<=NGrad,'Graduate Preferences'!A1004,\"\")","v":""},{"$f":"IF(A1003<=NGrad,Process!A1003,\"\")","v":""},{"$f":"IF(A1003<=NGrad,COUNTIFS('Graduate Preferences'!B1004:ZZ1004,C1003),\"\")","v":""},{"$f":"IF(A1003<=NGrad,IF(D1003=0,0,MATCH(C1003,'Graduate Preferences'!B1004:ZZ1004,0)),\"\")","v":""},"","","",null,null,null,""]
[1001,{"$f":"IF(A1004<=NGrad,'Graduate Preferences'!A1005,\"\")","v":""},{"$f":"IF(A1004<=NGrad,Process!A1004,\"\")","v":""},{"$f":"IF(A1004<=NGrad,COUNTIFS('Graduate Preferences'!B1005:ZZ1005,C1004),\"\")","v":""},{"$f":"IF(A1004<=NGrad,IF(D1004=0,0,MATCH(C1004,'Graduate Preferences'!B1005:ZZ1005,0)),\"\")","v":""},"","","",null,null,null,""]
[1002,{"$f":"IF(A1005<=NGrad,'Graduate Preferences'!A1006,\"\")","v":""},{"$f":"IF(A1005<=NGrad,Process!A1005,\"\")","v":""},{"$f":"IF(A1005<=NGrad,COUNTIFS('Graduate Preferences'!B1006:ZZ1006,C1005),\"\")","v":""},{"$f":"IF(A1005<=NGrad,IF(D1005=0,0,MATCH(C1005,'Graduate Preferences'!B1006:ZZ1006,0)),\"\")","v":""},"","","",null,null,null,""]
[1003,{"$f":"IF(A1006<=NGrad,'Graduate Preferences'!A1007,\"\")","v":""},{"$f":"IF(A1006<=NGrad,Process!A1006,\"\")","v":""},{"$f":"IF(A1006<=NGrad,COUNTIFS('Graduate Preferences'!B1007:ZZ1007,C1006),\"\")","v":""},{"$f":"IF(A1006<=NGrad,IF(D1006=0,0,MATCH(C1006,'Graduate Preferences'!B1007:ZZ1007,0)),\"\")","v":""},"","","",null,null,null,""]
[1004,{"$f":"IF(A1007<=NGrad,'Graduate Preferences'!A1008,\"\")","v":""},{"$f":"IF(A1007<=NGrad,Process!A1007,\"\")","v":""},{"$f":"IF(A1007<=NGrad,COUNTIFS('Graduate Preferences'!B1008:ZZ1008,C1007),\"\")","v":""},{"$f":"IF(A1007<=NGrad,IF(D1007=0,0,MATCH(C1007,'Graduate Preferences'!B1008:ZZ1008,0)),\"\")","v":""},"","","",null,null,null,""]
[1005,{"$f":"IF(A1008<=NGrad,'Graduate Preferences'!A1009,\"\")","v":""},{"$f":"IF(A1008<=NGrad,Process!A1008,\"\")","v":""},{"$f":"IF(A1008<=NGrad,COUNTIFS('Graduate Preferences'!B1009:ZZ1009,C1008),\"\")","v":""},{"$f":"IF(A1008<=NGrad,IF(D1008=0,0,MATCH(C1008,'Graduate Preferences'!B1009:ZZ1009,0)),\"\")","v":""},"","","",null,null,null,""]
[1006,{"$f":"IF(A1009<=NGrad,'Graduate Preferences'!A1010,\"\")","v":""},{"$f":"IF(A1009<=NGrad,Process!A1009,\"\")","v":""},{"$f":"IF(A1009<=NGrad,COUNTIFS('Graduate Preferences'!B1010:ZZ1010,C1009),\"\")","v":""},{"$f":"IF(A1009<=NGrad,IF(D1009=0,0,MATCH(C1009,'Graduate Preferences'!B1010:ZZ1010,0)),\"\")","v":""},"","","",null,null,null,""]
[1007,{"$f":"IF(A1010<=NGrad,'Graduate Preferences'!A1011,\"\")","v":""},{"$f":"IF(A1010<=NGrad,Process!A1010,\"\")","v":""},{"$f":"IF(A1010<=NGrad,COUNTIFS('Graduate Preferences'!B1011:ZZ1011,C1010),\"\")","v":""},{"$f":"IF(A1010<=NGrad,IF(D1010=0,0,MATCH(C1010,'Graduate Preferences'!B1011:ZZ1011,0)),\"\")","v":""},"","","",null,null,null,""]
[1008,{"$f":"IF(A1011<=NGrad,'Graduate Preferences'!A1012,\"\")","v":""},{"$f":"IF(A1011<=NGrad,Process!A1011,\"\")","v":""},{"$f":"IF(A1011<=NGrad,COUNTIFS('Graduate Preferences'!B1012:ZZ1012,C1011),\"\")","v":""},{"$f":"IF(A1011<=NGrad,IF(D1011=0,0,MATCH(C1011,'Graduate Preferences'!B1012:ZZ1012,0)),\"\")","v":""},"","","",null,null,null,""]
[1009,{"$f":"IF(A1012<=NGrad,'Graduate Preferences'!A1013,\"\")","v":""},{"$f":"IF(A1012<=NGrad,Process!A1012,\"\")","v":""},{"$f":"IF(A1012<=NGrad,COUNTIFS('Graduate Preferences'!B1013:ZZ1013,C1012),\"\")","v":""},{"$f":"IF(A1012<=NGrad,IF(D1012=0,0,MATCH(C1012,'Graduate Preferences'!B1013:ZZ1013,0)),\"\")","v":""},"","","",null,null,null,""]
[1010,{"$f":"IF(A1013<=NGrad,'Graduate Preferences'!A1014,\"\")","v":""},{"$f":"IF(A1013<=NGrad,Process!A1013,\"\")","v":""},{"$f":"IF(A1013<=NGrad,COUNTIFS('Graduate Preferences'!B1014:ZZ1014,C1013),\"\")","v":""},{"$f":"IF(A1013<=NGrad,IF(D1013=0,0,MATCH(C1013,'Graduate Preferences'!B1014:ZZ1014,0)),\"\")","v":""},"","","",null,null,null,""]
[1011,{"$f":"IF(A1014<=NGrad,'Graduate Preferences'!A1015,\"\")","v":""},{"$f":"IF(A1014<=NGrad,Process!A1014,\"\")","v":""},{"$f":"IF(A1014<=NGrad,COUNTIFS('Graduate Preferences'!B1015:ZZ1015,C1014),\"\")","v":""},{"$f":"IF(A1014<=NGrad,IF(D1014=0,0,MATCH(C1014,'Graduate Preferences'!B1015:ZZ1015,0)),\"\")","v":""},"","","",null,null,null,""]
[1012,{"$f":"IF(A1015<=NGrad,'Graduate Preferences'!A1016,\"\")","v":""},{"$f":"IF(A1015<=NGrad,Process!A1015,\"\")","v":""},{"$f":"IF(A1015<=NGrad,COUNTIFS('Graduate Preferences'!B1016:ZZ1016,C1015),\"\")","v":""},{"$f":"IF(A1015<=NGrad,IF(D1015=0,0,MATCH(C1015,'Graduate Preferences'!B1016:ZZ1016,0)),\"\")","v":""},"","","",null,null,null,""]
[1013,{"$f":"IF(A1016<=NGrad,'Graduate Preferences'!A1017,\"\")","v":""},{"$f":"IF(A1016<=NGrad,Process!A1016,\"\")","v":""},{"$f":"IF(A1016<=NGrad,COUNTIFS('Graduate Preferences'!B1017:ZZ1017,C1016),\"\")","v":""},{"$f":"IF(A1016<=NGrad,IF(D1016=0,0,MATCH(C1016,'Graduate Preferences'!B1017:ZZ1017,0)),\"\")","v":""},"","","",null,null,null,""]
[1014,{"$f":"IF(A1017<=NGrad,'Graduate Preferences'!A1018,\"\")","v":""},{"$f":"IF(A1017<=NGrad,Process!A1017,\"\")","v":""},{"$f":"IF(A1017<=NGrad,COUNTIFS('Graduate Preferences'!B1018:ZZ1018,C1017),\"\")","v":""},{"$f":"IF(A1017<=NGrad,IF(D1017=0,0,MATCH(C1017,'Graduate Preferences'!B1018:ZZ1018,0)),\"\")","v":""},"","","",null,null,null,""]
[1015,{"$f":"IF(A1018<=NGrad,'Graduate Preferences'!A1019,\"\")","v":""},{"$f":"IF(A1018<=NGrad,Process!A1018,\"\")","v":""},{"$f":"IF(A1018<=NGrad,COUNTIFS('Graduate Preferences'!B1019:ZZ1019,C1018),\"\")","v":""},{"$f":"IF(A1018<=NGrad,IF(D1018=0,0,MATCH(C1018,'Graduate Preferences'!B1019:ZZ1019,0)),\"\")","v":""},"","","",null,null,null,""]
[1016,{"$f":"IF(A1019<=NGrad,'Graduate Preferences'!A1020,\"\")","v":""},{"$f":"IF(A1019<=NGrad,Process!A1019,\"\")","v":""},{"$f":"IF(A1019<=NGrad,COUNTIFS('Graduate Preferences'!B1020:ZZ1020,C1019),\"\")","v":""},{"$f":"IF(A1019<=NGrad,IF(D1019=0,0,MATCH(C1019,'Graduate Preferences'!B1020:ZZ1020,0)),\"\")","v":""},"","","",null,null,null,""]
[1017,{"$f":"IF(A1020<=NGrad,'Graduate Preferences'!A1021,\"\")","v":""},{"$f":"IF(A1020<=NGrad,Process!A1020,\"\")","v":""},{"$f":"IF(A1020<=NGrad,COUNTIFS('Graduate Preferences'!B1021:ZZ1021,C1020),\"\")","v":""},{"$f":"IF(A1020<=NGrad,IF(D1020=0,0,MATCH(C1020,'Graduate Preferences'!B1021:ZZ1021,0)),\"\")","v":""},"","","",null,null,null,""]
[1018,{"$f":"IF(A1021<=NGrad,'Graduate Preferences'!A1022,\"\")","v":""},{"$f":"IF(A1021<=NGrad,Process!A1021,\"\")","v":""},{"$f":"IF(A1021<=NGrad,COUNTIFS('Graduate Preferences'!B1022:ZZ1022,C1021),\"\")","v":""},{"$f":"IF(A1021<=NGrad,IF(D1021=0,0,MATCH(C1021,'Graduate Preferences'!B1022:ZZ1022,0)),\"\")","v":""},"","","",null,null,null,""]
[1019,{"$f":"IF(A1022<=NGrad,'Graduate Preferences'!A1023,\"\")","v":""},{"$f":"IF(A1022<=NGrad,Process!A1022,\"\")","v":""},{"$f":"IF(A1022<=NGrad,COUNTIFS('Graduate Preferences'!B1023:ZZ1023,C1022),\"\")","v":""},{"$f":"IF(A1022<=NGrad,IF(D1022=0,0,MATCH(C1022,'Graduate Preferences'!B1023:ZZ1023,0)),\"\")","v":""},"","","",null,null,null,""]
[1020,{"$f":"IF(A1023<=NGrad,'Graduate Preferences'!A1024,\"\")","v":""},{"$f":"IF(A1023<=NGrad,Process!A1023,\"\")","v":""},{"$f":"IF(A1023<=NGrad,COUNTIFS('Graduate Preferences'!B1024:ZZ1024,C1023),\"\")","v":""},{"$f":"IF(A1023<=NGrad,IF(D1023=0,0,MATCH(C1023,'Graduate Preferences'!B1024:ZZ1024,0)),\"\")","v":""},"","","",null,null,null,""]
[1021,{"$f":"IF(A1024<=NGrad,'Graduate Preferences'!A1025,\"\")","v":""},{"$f":"IF(A1024<=NGrad,Process!A1024,\"\")","v":""},{"$f":"IF(A1024<=NGrad,COUNTIFS('Graduate Preferences'!B1025:ZZ1025,C1024),\"\")","v":""},{"$f":"IF(A1024<=NGrad,IF(D1024=0,0,MATCH(C1024,'Graduate Preferences'!B1025:ZZ1025,0)),\"\")","v":""},"","","",null,null,null,""]
[1022,{"$f":"IF(A1025<=NGrad,'Graduate Preferences'!A1026,\"\")","v":""},{"$f":"IF(A1025<=NGrad,Process!A1025,\"\")","v":""},{"$f":"IF(A1025<=NGrad,COUNTIFS('Graduate Preferences'!B1026:ZZ1026,C1025),\"\")","v":""},{"$f":"IF(A1025<=NGrad,IF(D1025=0,0,MATCH(C1025,'Graduate Preferences'!B1026:ZZ1026,0)),\"\")","v":""},"","","",null,null,null,""]
[1023,{"$f":"IF(A1026<=NGrad,'Graduate Preferences'!A1027,\"\")","v":""},{"$f":"IF(A1026<=NGrad,Process!A1026,\"\")","v":""},{"$f":"IF(A1026<=NGrad,COUNTIFS('Graduate Preferences'!B1027:ZZ1027,C1026),\"\")","v":""},{"$f":"IF(A1026<=NGrad,IF(D1026=0,0,MATCH(C1026,'Graduate Preferences'!B1027:ZZ1027,0)),\"\")","v":""},"","","",null,null,null,""]
[1024,{"$f":"IF(A1027<=NGrad,'Graduate Preferences'!A1028,\"\")","v":""},{"$f":"IF(A1027<=NGrad,Process!A1027,\"\")","v":""},{"$f":"IF(A1027<=NGrad,COUNTIFS('Graduate Preferences'!B1028:ZZ1028,C1027),\"\")","v":""},{"$f":"IF(A1027<=NGrad,IF(D1027=0,0,MATCH(C1027,'Graduate Preferences'!B1028:ZZ1028,0)),\"\")","v":""},"","","",null,null,null,""]
[1025,{"$f":"IF(A1028<=NGrad,'Graduate Preferences'!A1029,\"\")","v":""},{"$f":"IF(A1028<=NGrad,Process!A1028,\"\")","v":""},{"$f":"IF(A1028<=NGrad,COUNTIFS('Graduate Preferences'!B1029:ZZ1029,C1028),\"\")","v":""},{"$f":"IF(A1028<=NGrad,IF(D1028=0,0,MATCH(C1028,'Graduate Preferences'!B1029:ZZ1029,0)),\"\")","v":""},"","","",null,null,null,""]
[1026,{"$f":"IF(A1029<=NGrad,'Graduate Preferences'!A1030,\"\")","v":""},{"$f":"IF(A1029<=NGrad,Process!A1029,\"\")","v":""},{"$f":"IF(A1029<=NGrad,COUNTIFS('Graduate Preferences'!B1030:ZZ1030,C1029),\"\")","v":""},{"$f":"IF(A1029<=NGrad,IF(D1029=0,0,MATCH(C1029,'Graduate Preferences'!B1030:ZZ1030,0)),\"\")","v":""},"",{"$f":"IF(F1029=\"\",\"\",RANK(F1029,F$4:F$1000))","v":""},"",null,null,null,{"$f":"IF(MAX(H$4:H$1000)>=A1029,MATCH(A1029,H$4:H$1000,0),\"\")","v":""}]
[1027,{"$f":"IF(A1030<=NGrad,'Graduate Preferences'!A1031,\"\")","v":""},{"$f":"IF(A1030<=NGrad,Process!A1030,\"\")","v":""},{"$f":"IF(A1030<=NGrad,COUNTIFS('Graduate Preferences'!B1031:ZZ1031,C1030),\"\")","v":""},{"$f":"IF(A1030<=NGrad,IF(D1030=0,0,MATCH(C1030,'Graduate Preferences'!B1031:ZZ1031,0)),\"\")","v":""},{"$f":"IF(AND(J1030<>\"-\",J1030>0,I1030=F$2),J1030,\"\")","v":""},"",{"$f":"IF(F1030=\"\",\"\",MAX(G$4:G$1000)-G1030+1)","v":""},null,null,null,""]
[1028,{"$f":"IF(A1031<=NGrad,'Graduate Preferences'!A1032,\"\")","v":""},{"$f":"IF(A1031<=NGrad,Process!A1031,\"\")","v":""},{"$f":"IF(A1031<=NGrad,COUNTIFS('Graduate Preferences'!B1032:ZZ1032,C1031),\"\")","v":""},{"$f":"IF(A1031<=NGrad,IF(D1031=0,0,MATCH(C1031,'Graduate Preferences'!B1032:ZZ1032,0)),\"\")","v":""},"","","",null,null,null,""]
[1029,{"$f":"IF(A1032<=NGrad,'Graduate Preferences'!A1033,\"\")","v":""},{"$f":"IF(A1032<=NGrad,Process!A1032,\"\")","v":""},{"$f":"IF(A1032<=NGrad,COUNTIFS('Graduate Preferences'!B1033:ZZ1033,C1032),\"\")","v":""},{"$f":"IF(A1032<=NGrad,IF(D1032=0,0,MATCH(C1032,'Graduate Preferences'!B1033:ZZ1033,0)),\"\")","v":""},"","","",null,null,null,""]
[1030,{"$f":"IF(A1033<=NGrad,'Graduate Preferences'!A1034,\"\")","v":""},{"$f":"IF(A1033<=NGrad,Process!A1033,\"\")","v":""},{"$f":"IF(A1033<=NGrad,COUNTIFS('Graduate Preferences'!B1034:ZZ1034,C1033),\"\")","v":""},{"$f":"IF(A1033<=NGrad,IF(D1033=0,0,MATCH(C1033,'Graduate Preferences'!B1034:ZZ1034,0)),\"\")","v":""},"","","",null,null,null,""]
[1031,{"$f":"IF(A1034<=NGrad,'Graduate Preferences'!A1035,\"\")","v":""},{"$f":"IF(A1034<=NGrad,Process!A1034,\"\")","v":""},{"$f":"IF(A1034<=NGrad,COUNTIFS('Graduate Preferences'!B1035:ZZ1035,C1034),\"\")","v":""},{"$f":"IF(A1034<=NGrad,IF(D1034=0,0,MATCH(C1034,'Graduate Preferences'!B1035:ZZ1035,0)),\"\")","v":""},"","","",null,null,null,""]
[1032,{"$f":"IF(A1035<=NGrad,'Graduate Preferences'!A1036,\"\")","v":""},{"$f":"IF(A1035<=NGrad,Process!A1035,\"\")","v":""},{"$f":"IF(A1035<=NGrad,COUNTIFS('Graduate Preferences'!B1036:ZZ1036,C1035),\"\")","v":""},{"$f":"IF(A1035<=NGrad,IF(D1035=0,0,MATCH(C1035,'Graduate Preferences'!B1036:ZZ1036,0)),\"\")","v":""},"","","",null,null,null,""]
[1033,{"$f":"IF(A1036<=NGrad,'Graduate Preferences'!A1037,\"\")","v":""},{"$f":"IF(A1036<=NGrad,Process!A1036,\"\")","v":""},{"$f":"IF(A1036<=NGrad,COUNTIFS('Graduate Preferences'!B1037:ZZ1037,C1036),\"\")","v":""},{"$f":"IF(A1036<=NGrad,IF(D1036=0,0,MATCH(C1036,'Graduate Preferences'!B1037:ZZ1037,0)),\"\")","v":""},"","","",null,null,null,""]
[1034,{"$f":"IF(A1037<=NGrad,'Graduate Preferences'!A1038,\"\")","v":""},{"$f":"IF(A1037<=NGrad,Process!A1037,\"\")","v":""},{"$f":"IF(A1037<=NGrad,COUNTIFS('Graduate Preferences'!B1038:ZZ1038,C1037),\"\")","v":""},{"$f":"IF(A1037<=NGrad,IF(D1037=0,0,MATCH(C1037,'Graduate Preferences'!B1038:ZZ1038,0)),\"\")","v":""},"","","",null,null,null,""]
[1035,{"$f":"IF(A1038<=NGrad,'Graduate Preferences'!A1039,\"\")","v":""},{"$f":"IF(A1038<=NGrad,Process!A1038,\"\")","v":""},{"$f":"IF(A1038<=NGrad,COUNTIFS('Graduate Preferences'!B1039:ZZ1039,C1038),\"\")","v":""},{"$f":"IF(A1038<=NGrad,IF(D1038=0,0,MATCH(C1038,'Graduate Preferences'!B1039:ZZ1039,0)),\"\")","v":""},"","","",null,null,null,""]
[1036,{"$f":"IF(A1039<=NGrad,'Graduate Preferences'!A1040,\"\")","v":""},{"$f":"IF(A1039<=NGrad,Process!A1039,\"\")","v":""},{"$f":"IF(A1039<=NGrad,COUNTIFS('Graduate Preferences'!B1040:ZZ1040,C1039),\"\")","v":""},{"$f":"IF(A1039<=NGrad,IF(D1039=0,0,MATCH(C1039,'Graduate Preferences'!B1040:ZZ1040,0)),\"\")","v":""},"","","",null,null,null,""]
[1037,{"$f":"IF(A1040<=NGrad,'Graduate Preferences'!A1041,\"\")","v":""},{"$f":"IF(A1040<=NGrad,Process!A1040,\"\")","v":""},{"$f":"IF(A1040<=NGrad,COUNTIFS('Graduate Preferences'!B1041:ZZ1041,C1040),\"\")","v":""},{"$f":"IF(A1040<=NGrad,IF(D1040=0,0,MATCH(C1040,'Graduate Preferences'!B1041:ZZ1041,0)),\"\")","v":""},"","","",null,null,null,""]
[1038,{"$f":"IF(A1041<=NGrad,'Graduate Preferences'!A1042,\"\")","v":""},{"$f":"IF(A1041<=NGrad,Process!A1041,\"\")","v":""},{"$f":"IF(A1041<=NGrad,COUNTIFS('Graduate Preferences'!B1042:ZZ1042,C1041),\"\")","v":""},{"$f":"IF(A1041<=NGrad,IF(D1041=0,0,MATCH(C1041,'Graduate Preferences'!B1042:ZZ1042,0)),\"\")","v":""},"","","",null,null,null,""]
[1039,{"$f":"IF(A1042<=NGrad,'Graduate Preferences'!A1043,\"\")","v":""},{"$f":"IF(A1042<=NGrad,Process!A1042,\"\")","v":""},{"$f":"IF(A1042<=NGrad,COUNTIFS('Graduate Preferences'!B1043:ZZ1043,C1042),\"\")","v":""},{"$f":"IF(A1042<=NGrad,IF(D1042=0,0,MATCH(C1042,'Graduate Preferences'!B1043:ZZ1043,0)),\"\")","v":""},"","","",null,null,null,""]
[1040,{"$f":"IF(A1043<=NGrad,'Graduate Preferences'!A1044,\"\")","v":""},{"$f":"IF(A1043<=NGrad,Process!A1043,\"\")","v":""},{"$f":"IF(A1043<=NGrad,COUNTIFS('Graduate Preferences'!B1044:ZZ1044,C1043),\"\")","v":""},{"$f":"IF(A1043<=NGrad,IF(D1043=0,0,MATCH(C1043,'Graduate Preferences'!B1044:ZZ1044,0)),\"\")","v":""},"","","",null,null,null,""]
[1041,{"$f":"IF(A1044<=NGrad,'Graduate Preferences'!A1045,\"\")","v":""},{"$f":"IF(A1044<=NGrad,Process!A1044,\"\")","v":""},{"$f":"IF(A1044<=NGrad,COUNTIFS('Graduate Preferences'!B1045:ZZ1045,C1044),\"\")","v":""},{"$f":"IF(A1044<=NGrad,IF(D1044=0,0,MATCH(C1044,'Graduate Preferences'!B1045:ZZ1045,0)),\"\")","v":""},"","","",null,null,null,""]
[1042,{"$f":"IF(A1045<=NGrad,'Graduate Preferences'!A1046,\"\")","v":""},{"$f":"IF(A1045<=NGrad,Process!A1045,\"\")","v":""},{"$f":"IF(A1045<=NGrad,COUNTIFS('Graduate Preferences'!B1046:ZZ1046,C1045),\"\")","v":""},{"$f":"IF(A1045<=NGrad,IF(D1045=0,0,MATCH(C1045,'Graduate Preferences'!B1046:ZZ1046,0)),\"\")","v":""},"","","",null,null,null,""]
[1043,{"$f":"IF(A1046<=NGrad,'Graduate Preferences'!A1047,\"\")","v":""},{"$f":"IF(A1046<=NGrad,Process!A1046,\"\")","v":""},{"$f":"IF(A1046<=NGrad,COUNTIFS('Graduate Preferences'!B1047:ZZ1047,C1046),\"\")","v":""},{"$f":"IF(A1046<=NGrad,IF(D1046=0,0,MATCH(C1046,'Graduate Preferences'!B1047:ZZ1047,0)),\"\")","v":""},"","","",null,null,null,""]
[1044,{"$f":"IF(A1047<=NGrad,'Graduate Preferences'!A1048,\"\")","v":""},{"$f":"IF(A1047<=NGrad,Process!A1047,\"\")","v":""},{"$f":"IF(A1047<=NGrad,COUNTIFS('Graduate Preferences'!B1048:ZZ1048,C1047),\"\")","v":""},{"$f":"IF(A1047<=NGrad,IF(D1047=0,0,MATCH(C1047,'Graduate Preferences'!B1048:ZZ1048,0)),\"\")","v":""},"","","",null,null,null,""]
[1045,{"$f":"IF(A1048<=NGrad,'Graduate Preferences'!A1049,\"\")","v":""},{"$f":"IF(A1048<=NGrad,Process!A1048,\"\")","v":""},{"$f":"IF(A1048<=NGrad,COUNTIFS('Graduate Preferences'!B1049:ZZ1049,C1048),\"\")","v":""},{"$f":"IF(A1048<=NGrad,IF(D1048=0,0,MATCH(C1048,'Graduate Preferences'!B1049:ZZ1049,0)),\"\")","v":""},"","","",null,null,null,""]
[1046,{"$f":"IF(A1049<=NGrad,'Graduate Preferences'!A1050,\"\")","v":""},{"$f":"IF(A1049<=NGrad,Process!A1049,\"\")","v":""},{"$f":"IF(A1049<=NGrad,COUNTIFS('Graduate Preferences'!B1050:ZZ1050,C1049),\"\")","v":""},{"$f":"IF(A1049<=NGrad,IF(D1049=0,0,MATCH(C1049,'Graduate Preferences'!B1050:ZZ1050,0)),\"\")","v":""},"","","",null,null,null,""]
[1047,{"$f":"IF(A1050<=NGrad,'Graduate Preferences'!A1051,\"\")","v":""},{"$f":"IF(A1050<=NGrad,Process!A1050,\"\")","v":""},{"$f":"IF(A1050<=NGrad,COUNTIFS('Graduate Preferences'!B1051:ZZ1051,C1050),\"\")","v":""},{"$f":"IF(A1050<=NGrad,IF(D1050=0,0,MATCH(C1050,'Graduate Preferences'!B1051:ZZ1051,0)),\"\")","v":""},"","","",null,null,null,""]
[1048,{"$f":"IF(A1051<=NGrad,'Graduate Preferences'!A1052,\"\")","v":""},{"$f":"IF(A1051<=NGrad,Process!A1051,\"\")","v":""},{"$f":"IF(A1051<=NGrad,COUNTIFS('Graduate Preferences'!B1052:ZZ1052,C1051),\"\")","v":""},{"$f":"IF(A1051<=NGrad,IF(D1051=0,0,MATCH(C1051,'Graduate Preferences'!B1052:ZZ1052,0)),\"\")","v":""},"","","",null,null,null,""]
[1049,{"$f":"IF(A1052<=NGrad,'Graduate Preferences'!A1053,\"\")","v":""},{"$f":"IF(A1052<=NGrad,Process!A1052,\"\")","v":""},{"$f":"IF(A1052<=NGrad,COUNTIFS('Graduate Preferences'!B1053:ZZ1053,C1052),\"\")","v":""},{"$f":"IF(A1052<=NGrad,IF(D1052=0,0,MATCH(C1052,'Graduate Preferences'!B1053:ZZ1053,0)),\"\")","v":""},"","","",null,null,null,""]
[1050,{"$f":"IF(A1053<=NGrad,'Graduate Preferences'!A1054,\"\")","v":""},{"$f":"IF(A1053<=NGrad,Process!A1053,\"\")","v":""},{"$f":"IF(A1053<=NGrad,COUNTIFS('Graduate Preferences'!B1054:ZZ1054,C1053),\"\")","v":""},{"$f":"IF(A1053<=NGrad,IF(D1053=0,0,MATCH(C1053,'Graduate Preferences'!B1054:ZZ1054,0)),\"\")","v":""},"","","",null,null,null,""]
[1051,{"$f":"IF(A1054<=NGrad,'Graduate Preferences'!A1055,\"\")","v":""},{"$f":"IF(A1054<=NGrad,Process!A1054,\"\")","v":""},{"$f":"IF(A1054<=NGrad,COUNTIFS('Graduate Preferences'!B1055:ZZ1055,C1054),\"\")","v":""},{"$f":"IF(A1054<=NGrad,IF(D1054=0,0,MATCH(C1054,'Graduate Preferences'!B1055:ZZ1055,0)),\"\")","v":""},"","","",null,null,null,""]
[1052,{"$f":"IF(A1055<=NGrad,'Graduate Preferences'!A1056,\"\")","v":""},{"$f":"IF(A1055<=NGrad,Process!A1055,\"\")","v":""},{"$f":"IF(A1055<=NGrad,COUNTIFS('Graduate Preferences'!B1056:ZZ1056,C1055),\"\")","v":""},{"$f":"IF(A1055<=NGrad,IF(D1055=0,0,MATCH(C1055,'Graduate Preferences'!B1056:ZZ1056,0)),\"\")","v":""},"","","",null,null,null,""]
[1053,{"$f":"IF(A1056<=NGrad,'Graduate Preferences'!A1057,\"\")","v":""},{"$f":"IF(A1056<=NGrad,Process!A1056,\"\")","v":""},{"$f":"IF(A1056<=NGrad,COUNTIFS('Graduate Preferences'!B1057:ZZ1057,C1056),\"\")","v":""},{"$f":"IF(A1056<=NGrad,IF(D1056=0,0,MATCH(C1056,'Graduate Preferences'!B1057:ZZ1057,0)),\"\")","v":""},"","","",null,null,null,""]
[1054,{"$f":"IF(A1057<=NGrad,'Graduate Preferences'!A1058,\"\")","v":""},{"$f":"IF(A1057<=NGrad,Process!A1057,\"\")","v":""},{"$f":"IF(A1057<=NGrad,COUNTIFS('Graduate Preferences'!B1058:ZZ1058,C1057),\"\")","v":""},{"$f":"IF(A1057<=NGrad,IF(D1057=0,0,MATCH(C1057,'Graduate Preferences'!B1058:ZZ1058,0)),\"\")","v":""},"","","",null,null,null,""]
[1055,{"$f":"IF(A1058<=NGrad,'Graduate Preferences'!A1059,\"\")","v":""},{"$f":"IF(A1058<=NGrad,Process!A1058,\"\")","v":""},{"$f":"IF(A1058<=NGrad,COUNTIFS('Graduate Preferences'!B1059:ZZ1059,C1058),\"\")","v":""},{"$f":"IF(A1058<=NGrad,IF(D1058=0,0,MATCH(C1058,'Graduate Preferences'!B1059:ZZ1059,0)),\"\")","v":""},"","","",null,null,null,""]
[1056,{"$f":"IF(A1059<=NGrad,'Graduate Preferences'!A1060,\"\")","v":""},{"$f":"IF(A1059<=NGrad,Process!A1059,\"\")","v":""},{"$f":"IF(A1059<=NGrad,COUNTIFS('Graduate Preferences'!B1060:ZZ1060,C1059),\"\")","v":""},{"$f":"IF(A1059<=NGrad,IF(D1059=0,0,MATCH(C1059,'Graduate Preferences'!B1060:ZZ1060,0)),\"\")","v":""},"","","",null,null,null,""]
[1057,{"$f":"IF(A1060<=NGrad,'Graduate Preferences'!A1061,\"\")","v":""},{"$f":"IF(A1060<=NGrad,Process!A1060,\"\")","v":""},{"$f":"IF(A1060<=NGrad,COUNTIFS('Graduate Preferences'!B1061:ZZ1061,C1060),\"\")","v":""},{"$f":"IF(A1060<=NGrad,IF(D1060=0,0,MATCH(C1060,'Graduate Preferences'!B1061:ZZ1061,0)),\"\")","v":""},"","","",null,null,null,""]
[1058,{"$f":"IF(A1061<=NGrad,'Graduate Preferences'!A1062,\"\")","v":""},{"$f":"IF(A1061<=NGrad,Process!A1061,\"\")","v":""},{"$f":"IF(A1061<=NGrad,COUNTIFS('Graduate Preferences'!B1062:ZZ1062,C1061),\"\")","v":""},{"$f":"IF(A1061<=NGrad,IF(D1061=0,0,MATCH(C1061,'Graduate Preferences'!B1062:ZZ1062,0)),\"\")","v":""},"","","",null,null,null,""]
[1059,{"$f":"IF(A1062<=NGrad,'Graduate Preferences'!A1063,\"\")","v":""},{"$f":"IF(A1062<=NGrad,Process!A1062,\"\")","v":""},{"$f":"IF(A1062<=NGrad,COUNTIFS('Graduate Preferences'!B1063:ZZ1063,C1062),\"\")","v":""},{"$f":"IF(A1062<=NGrad,IF(D1062=0,0,MATCH(C1062,'Graduate Preferences'!B1063:ZZ1063,0)),\"\")","v":""},"","","",null,null,null,""]
[1060,{"$f":"IF(A1063<=NGrad,'Graduate Preferences'!A1064,\"\")","v":""},{"$f":"IF(A1063<=NGrad,Process!A1063,\"\")","v":""},{"$f":"IF(A1063<=NGrad,COUNTIFS('Graduate Preferences'!B1064:ZZ1064,C1063),\"\")","v":""},{"$f":"IF(A1063<=NGrad,IF(D1063=0,0,MATCH(C1063,'Graduate Preferences'!B1064:ZZ1064,0)),\"\")","v":""},"","","",null,null,null,""]
[1061,{"$f":"IF(A1064<=NGrad,'Graduate Preferences'!A1065,\"\")","v":""},{"$f":"IF(A1064<=NGrad,Process!A1064,\"\")","v":""},{"$f":"IF(A1064<=NGrad,COUNTIFS('Graduate Preferences'!B1065:ZZ1065,C1064),\"\")","v":""},{"$f":"IF(A1064<=NGrad,IF(D1064=0,0,MATCH(C1064,'Graduate Preferences'!B1065:ZZ1065,0)),\"\")","v":""},"","","",null,null,null,""]
[1062,{"$f":"IF(A1065<=NGrad,'Graduate Preferences'!A1066,\"\")","v":""},{"$f":"IF(A1065<=NGrad,Process!A1065,\"\")","v":""},{"$f":"IF(A1065<=NGrad,COUNTIFS('Graduate Preferences'!B1066:ZZ1066,C1065),\"\")","v":""},{"$f":"IF(A1065<=NGrad,IF(D1065=0,0,MATCH(C1065,'Graduate Preferences'!B1066:ZZ1066,0)),\"\")","v":""},"","","",null,null,null,""]
[1063,{"$f":"IF(A1066<=NGrad,'Graduate Preferences'!A1067,\"\")","v":""},{"$f":"IF(A1066<=NGrad,Process!A1066,\"\")","v":""},{"$f":"IF(A1066<=NGrad,COUNTIFS('Graduate Preferences'!B1067:ZZ1067,C1066),\"\")","v":""},{"$f":"IF(A1066<=NGrad,IF(D1066=0,0,MATCH(C1066,'Graduate Preferences'!B1067:ZZ1067,0)),\"\")","v":""},"","","",null,null,null,""]
[1064,{"$f":"IF(A1067<=NGrad,'Graduate Preferences'!A1068,\"\")","v":""},{"$f":"IF(A1067<=NGrad,Process!A1067,\"\")","v":""},{"$f":"IF(A1067<=NGrad,COUNTIFS('Graduate Preferences'!B1068:ZZ1068,C1067),\"\")","v":""},{"$f":"IF(A1067<=NGrad,IF(D1067=0,0,MATCH(C1067,'Graduate Preferences'!B1068:ZZ1068,0)),\"\")","v":""},"","","",null,null,null,""]
[1065,{"$f":"IF(A1068<=NGrad,'Graduate Preferences'!A1069,\"\")","v":""},{"$f":"IF(A1068<=NGrad,Process!A1068,\"\")","v":""},{"$f":"IF(A1068<=NGrad,COUNTIFS('Graduate Preferences'!B1069:ZZ1069,C1068),\"\")","v":""},{"$f":"IF(A1068<=NGrad,IF(D1068=0,0,MATCH(C1068,'Graduate Preferences'!B1069:ZZ1069,0)),\"\")","v":""},"","","",null,null,null,""]
[1066,{"$f":"IF(A1069<=NGrad,'Graduate Preferences'!A1070,\"\")","v":""},{"$f":"IF(A1069<=NGrad,Process!A1069,\"\")","v":""},{"$f":"IF(A1069<=NGrad,COUNTIFS('Graduate Preferences'!B1070:ZZ1070,C1069),\"\")","v":""},{"$f":"IF(A1069<=NGrad,IF(D1069=0,0,MATCH(C1069,'Graduate Preferences'!B1070:ZZ1070,0)),\"\")","v":""},"","","",null,null,null,""]
[1067,{"$f":"IF(A1070<=NGrad,'Graduate Preferences'!A1071,\"\")","v":""},{"$f":"IF(A1070<=NGrad,Process!A1070,\"\")","v":""},{"$f":"IF(A1070<=NGrad,COUNTIFS('Graduate Preferences'!B1071:ZZ1071,C1070),\"\")","v":""},{"$f":"IF(A1070<=NGrad,IF(D1070=0,0,MATCH(C1070,'Graduate Preferences'!B1071:ZZ1071,0)),\"\")","v":""},"","","",null,null,null,""]
[1068,{"$f":"IF(A1071<=NGrad,'Graduate Preferences'!A1072,\"\")","v":""},{"$f":"IF(A1071<=NGrad,Process!A1071,\"\")","v":""},{"$f":"IF(A1071<=NGrad,COUNTIFS('Graduate Preferences'!B1072:ZZ1072,C1071),\"\")","v":""},{"$f":"IF(A1071<=NGrad,IF(D1071=0,0,MATCH(C1071,'Graduate Preferences'!B1072:ZZ1072,0)),\"\")","v":""},"","","",null,null,null,""]
[1069,{"$f":"IF(A1072<=NGrad,'Graduate Preferences'!A1073,\"\")","v":""},{"$f":"IF(A1072<=NGrad,Process!A1072,\"\")","v":""},{"$f":"IF(A1072<=NGrad,COUNTIFS('Graduate Preferences'!B1073:ZZ1073,C1072),\"\")","v":""},{"$f":"IF(A1072<=NGrad,IF(D1072=0,0,MATCH(C1072,'Graduate Preferences'!B1073:ZZ1073,0)),\"\")","v":""},"","","",null,null,null,""]
[1070,{"$f":"IF(A1073<=NGrad,'Graduate Preferences'!A1074,\"\")","v":""},{"$f":"IF(A1073<=NGrad,Process!A1073,\"\")","v":""},{"$f":"IF(A1073<=NGrad,COUNTIFS('Graduate Preferences'!B1074:ZZ1074,C1073),\"\")","v":""},{"$f":"IF(A1073<=NGrad,IF(D1073=0,0,MATCH(C1073,'Graduate Preferences'!B1074:ZZ1074,0)),\"\")","v":""},"","","",null,null,null,""]
[1071,{"$f":"IF(A1074<=NGrad,'Graduate Preferences'!A1075,\"\")","v":""},{"$f":"IF(A1074<=NGrad,Process!A1074,\"\")","v":""},{"$f":"IF(A1074<=NGrad,COUNTIFS('Graduate Preferences'!B1075:ZZ1075,C1074),\"\")","v":""},{"$f":"IF(A1074<=NGrad,IF(D1074=0,0,MATCH(C1074,'Graduate Preferences'!B1075:ZZ1075,0)),\"\")","v":""},"","","",null,null,null,""]
[1072,{"$f":"IF(A1075<=NGrad,'Graduate Preferences'!A1076,\"\")","v":""},{"$f":"IF(A1075<=NGrad,Process!A1075,\"\")","v":""},{"$f":"IF(A1075<=NGrad,COUNTIFS('Graduate Preferences'!B1076:ZZ1076,C1075),\"\")","v":""},{"$f":"IF(A1075<=NGrad,IF(D1075=0,0,MATCH(C1075,'Graduate Preferences'!B1076:ZZ1076,0)),\"\")","v":""},"","","",null,null,null,""]
[1073,{"$f":"IF(A1076<=NGrad,'Graduate Preferences'!A1077,\"\")","v":""},{"$f":"IF(A1076<=NGrad,Process!A1076,\"\")","v":""},{"$f":"IF(A1076<=NGrad,COUNTIFS('Graduate Preferences'!B1077:ZZ1077,C1076),\"\")","v":""},{"$f":"IF(A1076<=NGrad,IF(D1076=0,0,MATCH(C1076,'Graduate Preferences'!B1077:ZZ1077,0)),\"\")","v":""},"","","",null,null,null,""]
[1074,{"$f":"IF(A1077<=NGrad,'Graduate Preferences'!A1078,\"\")","v":""},{"$f":"IF(A1077<=NGrad,Process!A1077,\"\")","v":""},{"$f":"IF(A1077<=NGrad,COUNTIFS('Graduate Preferences'!B1078:ZZ1078,C1077),\"\")","v":""},{"$f":"IF(A1077<=NGrad,IF(D1077=0,0,MATCH(C1077,'Graduate Preferences'!B1078:ZZ1078,0)),\"\")","v":""},"","","",null,null,null,""]
[1075,{"$f":"IF(A1078<=NGrad,'Graduate Preferences'!A1079,\"\")","v":""},{"$f":"IF(A1078<=NGrad,Process!A1078,\"\")","v":""},{"$f":"IF(A1078<=NGrad,COUNTIFS('Graduate Preferences'!B1079:ZZ1079,C1078),\"\")","v":""},{"$f":"IF(A1078<=NGrad,IF(D1078=0,0,MATCH(C1078,'Graduate Preferences'!B1079:ZZ1079,0)),\"\")","v":""},"","","",null,null,null,""]
[1076,{"$f":"IF(A1079<=NGrad,'Graduate Preferences'!A1080,\"\")","v":""},{"$f":"IF(A1079<=NGrad,Process!A1079,\"\")","v":""},{"$f":"IF(A1079<=NGrad,COUNTIFS('Graduate Preferences'!B1080:ZZ1080,C1079),\"\")","v":""},{"$f":"IF(A1079<=NGrad,IF(D1079=0,0,MATCH(C1079,'Graduate Preferences'!B1080:ZZ1080,0)),\"\")","v":""},"","","",null,null,null,""]
[1077,{"$f":"IF(A1080<=NGrad,'Graduate Preferences'!A1081,\"\")","v":""},{"$f":"IF(A1080<=NGrad,Process!A1080,\"\")","v":""},{"$f":"IF(A1080<=NGrad,COUNTIFS('Graduate Preferences'!B1081:ZZ1081,C1080),\"\")","v":""},{"$f":"IF(A1080<=NGrad,IF(D1080=0,0,MATCH(C1080,'Graduate Preferences'!B1081:ZZ1081,0)),\"\")","v":""},"","","",null,null,null,""]
[1078,{"$f":"IF(A1081<=NGrad,'Graduate Preferences'!A1082,\"\")","v":""},{"$f":"IF(A1081<=NGrad,Process!A1081,\"\")","v":""},{"$f":"IF(A1081<=NGrad,COUNTIFS('Graduate Preferences'!B1082:ZZ1082,C1081),\"\")","v":""},{"$f":"IF(A1081<=NGrad,IF(D1081=0,0,MATCH(C1081,'Graduate Preferences'!B1082:ZZ1082,0)),\"\")","v":""},"","","",null,null,null,""]
[1079,{"$f":"IF(A1082<=NGrad,'Graduate Preferences'!A1083,\"\")","v":""},{"$f":"IF(A1082<=NGrad,Process!A1082,\"\")","v":""},{"$f":"IF(A1082<=NGrad,COUNTIFS('Graduate Preferences'!B1083:ZZ1083,C1082),\"\")","v":""},{"$f":"IF(A1082<=NGrad,IF(D1082=0,0,MATCH(C1082,'Graduate Preferences'!B1083:ZZ1083,0)),\"\")","v":""},"","","",null,null,null,""]
[1080,{"$f":"IF(A1083<=NGrad,'Graduate Preferences'!A1084,\"\")","v":""},{"$f":"IF(A1083<=NGrad,Process!A1083,\"\")","v":""},{"$f":"IF(A1083<=NGrad,COUNTIFS('Graduate Preferences'!B1084:ZZ1084,C1083),\"\")","v":""},{"$f":"IF(A1083<=NGrad,IF(D1083=0,0,MATCH(C1083,'Graduate Preferences'!B1084:ZZ1084,0)),\"\")","v":""},"","","",null,null,null,""]
[1081,{"$f":"IF(A1084<=NGrad,'Graduate Preferences'!A1085,\"\")","v":""},{"$f":"IF(A1084<=NGrad,Process!A1084,\"\")","v":""},{"$f":"IF(A1084<=NGrad,COUNTIFS('Graduate Preferences'!B1085:ZZ1085,C1084),\"\")","v":""},{"$f":"IF(A1084<=NGrad,IF(D1084=0,0,MATCH(C1084,'Graduate Preferences'!B1085:ZZ1085,0)),\"\")","v":""},"","","",null,null,null,""]
[1082,{"$f":"IF(A1085<=NGrad,'Graduate Preferences'!A1086,\"\")","v":""},{"$f":"IF(A1085<=NGrad,Process!A1085,\"\")","v":""},{"$f":"IF(A1085<=NGrad,COUNTIFS('Graduate Preferences'!B1086:ZZ1086,C1085),\"\")","v":""},{"$f":"IF(A1085<=NGrad,IF(D1085=0,0,MATCH(C1085,'Graduate Preferences'!B1086:ZZ1086,0)),\"\")","v":""},"","","",null,null,null,""]
[1083,{"$f":"IF(A1086<=NGrad,'Graduate Preferences'!A1087,\"\")","v":""},{"$f":"IF(A1086<=NGrad,Process!A1086,\"\")","v":""},{"$f":"IF(A1086<=NGrad,COUNTIFS('Graduate Preferences'!B1087:ZZ1087,C1086),\"\")","v":""},{"$f":"IF(A1086<=NGrad,IF(D1086=0,0,MATCH(C1086,'Graduate Preferences'!B1087:ZZ1087,0)),\"\")","v":""},"","","",null,null,null,""]
[1084,{"$f":"IF(A1087<=NGrad,'Graduate Preferences'!A1088,\"\")","v":""},{"$f":"IF(A1087<=NGrad,Process!A1087,\"\")","v":""},{"$f":"IF(A1087<=NGrad,COUNTIFS('Graduate Preferences'!B1088:ZZ1088,C1087),\"\")","v":""},{"$f":"IF(A1087<=NGrad,IF(D1087=0,0,MATCH(C1087,'Graduate Preferences'!B1088:ZZ1088,0)),\"\")","v":""},"","","",null,null,null,""]
[1085,{"$f":"IF(A1088<=NGrad,'Graduate Preferences'!A1089,\"\")","v":""},{"$f":"IF(A1088<=NGrad,Process!A1088,\"\")","v":""},{"$f":"IF(A1088<=NGrad,COUNTIFS('Graduate Preferences'!B1089:ZZ1089,C1088),\"\")","v":""},{"$f":"IF(A1088<=NGrad,IF(D1088=0,0,MATCH(C1088,'Graduate Preferences'!B1089:ZZ1089,0)),\"\")","v":""},"","","",null,null,null,""]
[1086,{"$f":"IF(A1089<=NGrad,'Graduate Preferences'!A1090,\"\")","v":""},{"$f":"IF(A1089<=NGrad,Process!A1089,\"\")","v":""},{"$f":"IF(A1089<=NGrad,COUNTIFS('Graduate Preferences'!B1090:ZZ1090,C1089),\"\")","v":""},{"$f":"IF(A1089<=NGrad,IF(D1089=0,0,MATCH(C1089,'Graduate Preferences'!B1090:ZZ1090,0)),\"\")","v":""},"","","",null,null,null,""]
[1087,{"$f":"IF(A1090<=NGrad,'Graduate Preferences'!A1091,\"\")","v":""},{"$f":"IF(A1090<=NGrad,Process!A1090,\"\")","v":""},{"$f":"IF(A1090<=NGrad,COUNTIFS('Graduate Preferences'!B1091:ZZ1091,C1090),\"\")","v":""},{"$f":"IF(A1090<=NGrad,IF(D1090=0,0,MATCH(C1090,'Graduate Preferences'!B1091:ZZ1091,0)),\"\")","v":""},"","","",null,null,null,""]
[1088,{"$f":"IF(A1091<=NGrad,'Graduate Preferences'!A1092,\"\")","v":""},{"$f":"IF(A1091<=NGrad,Process!A1091,\"\")","v":""},{"$f":"IF(A1091<=NGrad,COUNTIFS('Graduate Preferences'!B1092:ZZ1092,C1091),\"\")","v":""},{"$f":"IF(A1091<=NGrad,IF(D1091=0,0,MATCH(C1091,'Graduate Preferences'!B1092:ZZ1092,0)),\"\")","v":""},"","","",null,null,null,""]
[1089,{"$f":"IF(A1092<=NGrad,'Graduate Preferences'!A1093,\"\")","v":""},{"$f":"IF(A1092<=NGrad,Process!A1092,\"\")","v":""},{"$f":"IF(A1092<=NGrad,COUNTIFS('Graduate Preferences'!B1093:ZZ1093,C1092),\"\")","v":""},{"$f":"IF(A1092<=NGrad,IF(D1092=0,0,MATCH(C1092,'Graduate Preferences'!B1093:ZZ1093,0)),\"\")","v":""},"","","",null,null,null,""]
[1090,{"$f":"IF(A1093<=NGrad,'Graduate Preferences'!A1094,\"\")","v":""},{"$f":"IF(A1093<=NGrad,Process!A1093,\"\")","v":""},{"$f":"IF(A1093<=NGrad,COUNTIFS('Graduate Preferences'!B1094:ZZ1094,C1093),\"\")","v":""},{"$f":"IF(A1093<=NGrad,IF(D1093=0,0,MATCH(C1093,'Graduate Preferences'!B1094:ZZ1094,0)),\"\")","v":""},"",{"$f":"IF(F1093=\"\",\"\",RANK(F1093,F$4:F$1000))","v":""},"",null,null,null,{"$f":"IF(MAX(H$4:H$1000)>=A1093,MATCH(A1093,H$4:H$1000,0),\"\")","v":""}]
[1091,{"$f":"IF(A1094<=NGrad,'Graduate Preferences'!A1095,\"\")","v":""},{"$f":"IF(A1094<=NGrad,Process!A1094,\"\")","v":""},{"$f":"IF(A1094<=NGrad,COUNTIFS('Graduate Preferences'!B1095:ZZ1095,C1094),\"\")","v":""},{"$f":"IF(A1094<=NGrad,IF(D1094=0,0,MATCH(C1094,'Graduate Preferences'!B1095:ZZ1095,0)),\"\")","v":""},{"$f":"IF(AND(J1094<>\"-\",J1094>0,I1094=F$2),J1094,\"\")","v":""},"",{"$f":"IF(F1094=\"\",\"\",MAX(G$4:G$1000)-G1094+1)","v":""},null,null,null,""]
[1092,{"$f":"IF(A1095<=NGrad,'Graduate Preferences'!A1096,\"\")","v":""},{"$f":"IF(A1095<=NGrad,Process!A1095,\"\")","v":""},{"$f":"IF(A1095<=NGrad,COUNTIFS('Graduate Preferences'!B1096:ZZ1096,C1095),\"\")","v":""},{"$f":"IF(A1095<=NGrad,IF(D1095=0,0,MATCH(C1095,'Graduate Preferences'!B1096:ZZ1096,0)),\"\")","v":""},"","","",null,null,null,""]
[1093,{"$f":"IF(A1096<=NGrad,'Graduate Preferences'!A1097,\"\")","v":""},{"$f":"IF(A1096<=NGrad,Process!A1096,\"\")","v":""},{"$f":"IF(A1096<=NGrad,COUNTIFS('Graduate Preferences'!B1097:ZZ1097,C1096),\"\")","v":""},{"$f":"IF(A1096<=NGrad,IF(D1096=0,0,MATCH(C1096,'Graduate Preferences'!B1097:ZZ1097,0)),\"\")","v":""},"","","",null,null,null,""]
[1094,{"$f":"IF(A1097<=NGrad,'Graduate Preferences'!A1098,\"\")","v":""},{"$f":"IF(A1097<=NGrad,Process!A1097,\"\")","v":""},{"$f":"IF(A1097<=NGrad,COUNTIFS('Graduate Preferences'!B1098:ZZ1098,C1097),\"\")","v":""},{"$f":"IF(A1097<=NGrad,IF(D1097=0,0,MATCH(C1097,'Graduate Preferences'!B1098:ZZ1098,0)),\"\")","v":""},"","","",null,null,null,""]
[1095,{"$f":"IF(A1098<=NGrad,'Graduate Preferences'!A1099,\"\")","v":""},{"$f":"IF(A1098<=NGrad,Process!A1098,\"\")","v":""},{"$f":"IF(A1098<=NGrad,COUNTIFS('Graduate Preferences'!B1099:ZZ1099,C1098),\"\")","v":""},{"$f":"IF(A1098<=NGrad,IF(D1098=0,0,MATCH(C1098,'Graduate Preferences'!B1099:ZZ1099,0)),\"\")","v":""},"","","",null,null,null,""]
[1096,{"$f":"IF(A1099<=NGrad,'Graduate Preferences'!A1100,\"\")","v":""},{"$f":"IF(A1099<=NGrad,Process!A1099,\"\")","v":""},{"$f":"IF(A1099<=NGrad,COUNTIFS('Graduate Preferences'!B1100:ZZ1100,C1099),\"\")","v":""},{"$f":"IF(A1099<=NGrad,IF(D1099=0,0,MATCH(C1099,'Graduate Preferences'!B1100:ZZ1100,0)),\"\")","v":""},"","","",null,null,null,""]
[1097,{"$f":"IF(A1100<=NGrad,'Graduate Preferences'!A1101,\"\")","v":""},{"$f":"IF(A1100<=NGrad,Process!A1100,\"\")","v":""},{"$f":"IF(A1100<=NGrad,COUNTIFS('Graduate Preferences'!B1101:ZZ1101,C1100),\"\")","v":""},{"$f":"IF(A1100<=NGrad,IF(D1100=0,0,MATCH(C1100,'Graduate Preferences'!B1101:ZZ1101,0)),\"\")","v":""},"","","",null,null,null,""]
[1098,{"$f":"IF(A1101<=NGrad,'Graduate Preferences'!A1102,\"\")","v":""},{"$f":"IF(A1101<=NGrad,Process!A1101,\"\")","v":""},{"$f":"IF(A1101<=NGrad,COUNTIFS('Graduate Preferences'!B1102:ZZ1102,C1101),\"\")","v":""},{"$f":"IF(A1101<=NGrad,IF(D1101=0,0,MATCH(C1101,'Graduate Preferences'!B1102:ZZ1102,0)),\"\")","v":""},"","","",null,null,null,""]
[1099,{"$f":"IF(A1102<=NGrad,'Graduate Preferences'!A1103,\"\")","v":""},{"$f":"IF(A1102<=NGrad,Process!A1102,\"\")","v":""},{"$f":"IF(A1102<=NGrad,COUNTIFS('Graduate Preferences'!B1103:ZZ1103,C1102),\"\")","v":""},{"$f":"IF(A1102<=NGrad,IF(D1102=0,0,MATCH(C1102,'Graduate Preferences'!B1103:ZZ1103,0)),\"\")","v":""},"","","",null,null,null,""]
[1100,{"$f":"IF(A1103<=NGrad,'Graduate Preferences'!A1104,\"\")","v":""},{"$f":"IF(A1103<=NGrad,Process!A1103,\"\")","v":""},{"$f":"IF(A1103<=NGrad,COUNTIFS('Graduate Preferences'!B1104:ZZ1104,C1103),\"\")","v":""},{"$f":"IF(A1103<=NGrad,IF(D1103=0,0,MATCH(C1103,'Graduate Preferences'!B1104:ZZ1104,0)),\"\")","v":""},"","","",null,null,null,""]
[1101,{"$f":"IF(A1104<=NGrad,'Graduate Preferences'!A1105,\"\")","v":""},{"$f":"IF(A1104<=NGrad,Process!A1104,\"\")","v":""},{"$f":"IF(A1104<=NGrad,COUNTIFS('Graduate Preferences'!B1105:ZZ1105,C1104),\"\")","v":""},{"$f":"IF(A1104<=NGrad,IF(D1104=0,0,MATCH(C1104,'Graduate Preferences'!B1105:ZZ1105,0)),\"\")","v":""},"","","",null,null,null,""]
[1102,{"$f":"IF(A1105<=NGrad,'Graduate Preferences'!A1106,\"\")","v":""},{"$f":"IF(A1105<=NGrad,Process!A1105,\"\")","v":""},{"$f":"IF(A1105<=NGrad,COUNTIFS('Graduate Preferences'!B1106:ZZ1106,C1105),\"\")","v":""},{"$f":"IF(A1105<=NGrad,IF(D1105=0,0,MATCH(C1105,'Graduate Preferences'!B1106:ZZ1106,0)),\"\")","v":""},"","","",null,null,null,""]
[1103,{"$f":"IF(A1106<=NGrad,'Graduate Preferences'!A1107,\"\")","v":""},{"$f":"IF(A1106<=NGrad,Process!A1106,\"\")","v":""},{"$f":"IF(A1106<=NGrad,COUNTIFS('Graduate Preferences'!B1107:ZZ1107,C1106),\"\")","v":""},{"$f":"IF(A1106<=NGrad,IF(D1106=0,0,MATCH(C1106,'Graduate Preferences'!B1107:ZZ1107,0)),\"\")","v":""},"","","",null,null,null,""]
[1104,{"$f":"IF(A1107<=NGrad,'Graduate Preferences'!A1108,\"\")","v":""},{"$f":"IF(A1107<=NGrad,Process!A1107,\"\")","v":""},{"$f":"IF(A1107<=NGrad,COUNTIFS('Graduate Preferences'!B1108:ZZ1108,C1107),\"\")","v":""},{"$f":"IF(A1107<=NGrad,IF(D1107=0,0,MATCH(C1107,'Graduate Preferences'!B1108:ZZ1108,0)),\"\")","v":""},"","","",null,null,null,""]
[1105,{"$f":"IF(A1108<=NGrad,'Graduate Preferences'!A1109,\"\")","v":""},{"$f":"IF(A1108<=NGrad,Process!A1108,\"\")","v":""},{"$f":"IF(A1108<=NGrad,COUNTIFS('Graduate Preferences'!B1109:ZZ1109,C1108),\"\")","v":""},{"$f":"IF(A1108<=NGrad,IF(D1108=0,0,MATCH(C1108,'Graduate Preferences'!B1109:ZZ1109,0)),\"\")","v":""},"","","",null,null,null,""]
[1106,{"$f":"IF(A1109<=NGrad,'Graduate Preferences'!A1110,\"\")","v":""},{"$f":"IF(A1109<=NGrad,Process!A1109,\"\")","v":""},{"$f":"IF(A1109<=NGrad,COUNTIFS('Graduate Preferences'!B1110:ZZ1110,C1109),\"\")","v":""},{"$f":"IF(A1109<=NGrad,IF(D1109=0,0,MATCH(C1109,'Graduate Preferences'!B1110:ZZ1110,0)),\"\")","v":""},"","","",null,null,null,""]
[1107,{"$f":"IF(A1110<=NGrad,'Graduate Preferences'!A1111,\"\")","v":""},{"$f":"IF(A1110<=NGrad,Process!A1110,\"\")","v":""},{"$f":"IF(A1110<=NGrad,COUNTIFS('Graduate Preferences'!B1111:ZZ1111,C1110),\"\")","v":""},{"$f":"IF(A1110<=NGrad,IF(D1110=0,0,MATCH(C1110,'Graduate Preferences'!B1111:ZZ1111,0)),\"\")","v":""},"","","",null,null,null,""]
[1108,{"$f":"IF(A1111<=NGrad,'Graduate Preferences'!A1112,\"\")","v":""},{"$f":"IF(A1111<=NGrad,Process!A1111,\"\")","v":""},{"$f":"IF(A1111<=NGrad,COUNTIFS('Graduate Preferences'!B1112:ZZ1112,C1111),\"\")","v":""},{"$f":"IF(A1111<=NGrad,IF(D1111=0,0,MATCH(C1111,'Graduate Preferences'!B1112:ZZ1112,0)),\"\")","v":""},"","","",null,null,null,""]
[1109,{"$f":"IF(A1112<=NGrad,'Graduate Preferences'!A1113,\"\")","v":""},{"$f":"IF(A1112<=NGrad,Process!A1112,\"\")","v":""},{"$f":"IF(A1112<=NGrad,COUNTIFS('Graduate Preferences'!B1113:ZZ1113,C1112),\"\")","v":""},{"$f":"IF(A1112<=NGrad,IF(D1112=0,0,MATCH(C1112,'Graduate Preferences'!B1113:ZZ1113,0)),\"\")","v":""},"","","",null,null,null,""]
[1110,{"$f":"IF(A1113<=NGrad,'Graduate Preferences'!A1114,\"\")","v":""},{"$f":"IF(A1113<=NGrad,Process!A1113,\"\")","v":""},{"$f":"IF(A1113<=NGrad,COUNTIFS('Graduate Preferences'!B1114:ZZ1114,C1113),\"\")","v":""},{"$f":"IF(A1113<=NGrad,IF(D1113=0,0,MATCH(C1113,'Graduate Preferences'!B1114:ZZ1114,0)),\"\")","v":""},"","","",null,null,null,""]
[1111,{"$f":"IF(A1114<=NGrad,'Graduate Preferences'!A1115,\"\")","v":""},{"$f":"IF(A1114<=NGrad,Process!A1114,\"\")","v":""},{"$f":"IF(A1114<=NGrad,COUNTIFS('Graduate Preferences'!B1115:ZZ1115,C1114),\"\")","v":""},{"$f":"IF(A1114<=NGrad,IF(D1114=0,0,MATCH(C1114,'Graduate Preferences'!B1115:ZZ1115,0)),\"\")","v":""},"","","",null,null,null,""]
[1112,{"$f":"IF(A1115<=NGrad,'Graduate Preferences'!A1116,\"\")","v":""},{"$f":"IF(A1115<=NGrad,Process!A1115,\"\")","v":""},{"$f":"IF(A1115<=NGrad,COUNTIFS('Graduate Preferences'!B1116:ZZ1116,C1115),\"\")","v":""},{"$f":"IF(A1115<=NGrad,IF(D1115=0,0,MATCH(C1115,'Graduate Preferences'!B1116:ZZ1116,0)),\"\")","v":""},"","","",null,null,null,""]
[1113,{"$f":"IF(A1116<=NGrad,'Graduate Preferences'!A1117,\"\")","v":""},{"$f":"IF(A1116<=NGrad,Process!A1116,\"\")","v":""},{"$f":"IF(A1116<=NGrad,COUNTIFS('Graduate Preferences'!B1117:ZZ1117,C1116),\"\")","v":""},{"$f":"IF(A1116<=NGrad,IF(D1116=0,0,MATCH(C1116,'Graduate Preferences'!B1117:ZZ1117,0)),\"\")","v":""},"","","",null,null,null,""]
[1114,{"$f":"IF(A1117<=NGrad,'Graduate Preferences'!A1118,\"\")","v":""},{"$f":"IF(A1117<=NGrad,Process!A1117,\"\")","v":""},{"$f":"IF(A1117<=NGrad,COUNTIFS('Graduate Preferences'!B1118:ZZ1118,C1117),\"\")","v":""},{"$f":"IF(A1117<=NGrad,IF(D1117=0,0,MATCH(C1117,'Graduate Preferences'!B1118:ZZ1118,0)),\"\")","v":""},"","","",null,null,null,""]
[1115,{"$f":"IF(A1118<=NGrad,'Graduate Preferences'!A1119,\"\")","v":""},{"$f":"IF(A1118<=NGrad,Process!A1118,\"\")","v":""},{"$f":"IF(A1118<=NGrad,COUNTIFS('Graduate Preferences'!B1119:ZZ1119,C1118),\"\")","v":""},{"$f":"IF(A1118<=NGrad,IF(D1118=0,0,MATCH(C1118,'Graduate Preferences'!B1119:ZZ1119,0)),\"\")","v":""},"","","",null,null,null,""]
[1116,{"$f":"IF(A1119<=NGrad,'Graduate Preferences'!A1120,\"\")","v":""},{"$f":"IF(A1119<=NGrad,Process!A1119,\"\")","v":""},{"$f":"IF(A1119<=NGrad,COUNTIFS('Graduate Preferences'!B1120:ZZ1120,C1119),\"\")","v":""},{"$f":"IF(A1119<=NGrad,IF(D1119=0,0,MATCH(C1119,'Graduate Preferences'!B1120:ZZ1120,0)),\"\")","v":""},"","","",null,null,null,""]
[1117,{"$f":"IF(A1120<=NGrad,'Graduate Preferences'!A1121,\"\")","v":""},{"$f":"IF(A1120<=NGrad,Process!A1120,\"\")","v":""},{"$f":"IF(A1120<=NGrad,COUNTIFS('Graduate Preferences'!B1121:ZZ1121,C1120),\"\")","v":""},{"$f":"IF(A1120<=NGrad,IF(D1120=0,0,MATCH(C1120,'Graduate Preferences'!B1121:ZZ1121,0)),\"\")","v":""},"","","",null,null,null,""]
[1118,{"$f":"IF(A1121<=NGrad,'Graduate Preferences'!A1122,\"\")","v":""},{"$f":"IF(A1121<=NGrad,Process!A1121,\"\")","v":""},{"$f":"IF(A1121<=NGrad,COUNTIFS('Graduate Preferences'!B1122:ZZ1122,C1121),\"\")","v":""},{"$f":"IF(A1121<=NGrad,IF(D1121=0,0,MATCH(C1121,'Graduate Preferences'!B1122:ZZ1122,0)),\"\")","v":""},"","","",null,null,null,""]
[1119,{"$f":"IF(A1122<=NGrad,'Graduate Preferences'!A1123,\"\")","v":""},{"$f":"IF(A1122<=NGrad,Process!A1122,\"\")","v":""},{"$f":"IF(A1122<=NGrad,COUNTIFS('Graduate Preferences'!B1123:ZZ1123,C1122),\"\")","v":""},{"$f":"IF(A1122<=NGrad,IF(D1122=0,0,MATCH(C1122,'Graduate Preferences'!B1123:ZZ1123,0)),\"\")","v":""},"","","",null,null,null,""]
[1120,{"$f":"IF(A1123<=NGrad,'Graduate Preferences'!A1124,\"\")","v":""},{"$f":"IF(A1123<=NGrad,Process!A1123,\"\")","v":""},{"$f":"IF(A1123<=NGrad,COUNTIFS('Graduate Preferences'!B1124:ZZ1124,C1123),\"\")","v":""},{"$f":"IF(A1123<=NGrad,IF(D1123=0,0,MATCH(C1123,'Graduate Preferences'!B1124:ZZ1124,0)),\"\")","v":""},"","","",null,null,null,""]
[1121,{"$f":"IF(A1124<=NGrad,'Graduate Preferences'!A1125,\"\")","v":""},{"$f":"IF(A1124<=NGrad,Process!A1124,\"\")","v":""},{"$f":"IF(A1124<=NGrad,COUNTIFS('Graduate Preferences'!B1125:ZZ1125,C1124),\"\")","v":""},{"$f":"IF(A1124<=NGrad,IF(D1124=0,0,MATCH(C1124,'Graduate Preferences'!B1125:ZZ1125,0)),\"\")","v":""},"","","",null,null,null,""]
[1122,{"$f":"IF(A1125<=NGrad,'Graduate Preferences'!A1126,\"\")","v":""},{"$f":"IF(A1125<=NGrad,Process!A1125,\"\")","v":""},{"$f":"IF(A1125<=NGrad,COUNTIFS('Graduate Preferences'!B1126:ZZ1126,C1125),\"\")","v":""},{"$f":"IF(A1125<=NGrad,IF(D1125=0,0,MATCH(C1125,'Graduate Preferences'!B1126:ZZ1126,0)),\"\")","v":""},"","","",null,null,null,""]
[1123,{"$f":"IF(A1126<=NGrad,'Graduate Preferences'!A1127,\"\")","v":""},{"$f":"IF(A1126<=NGrad,Process!A1126,\"\")","v":""},{"$f":"IF(A1126<=NGrad,COUNTIFS('Graduate Preferences'!B1127:ZZ1127,C1126),\"\")","v":""},{"$f":"IF(A1126<=NGrad,IF(D1126=0,0,MATCH(C1126,'Graduate Preferences'!B1127:ZZ1127,0)),\"\")","v":""},"","","",null,null,null,""]
[1124,{"$f":"IF(A1127<=NGrad,'Graduate Preferences'!A1128,\"\")","v":""},{"$f":"IF(A1127<=NGrad,Process!A1127,\"\")","v":""},{"$f":"IF(A1127<=NGrad,COUNTIFS('Graduate Preferences'!B1128:ZZ1128,C1127),\"\")","v":""},{"$f":"IF(A1127<=NGrad,IF(D1127=0,0,MATCH(C1127,'Graduate Preferences'!B1128:ZZ1128,0)),\"\")","v":""},"","","",null,null,null,""]
[1125,{"$f":"IF(A1128<=NGrad,'Graduate Preferences'!A1129,\"\")","v":""},{"$f":"IF(A1128<=NGrad,Process!A1128,\"\")","v":""},{"$f":"IF(A1128<=NGrad,COUNTIFS('Graduate Preferences'!B1129:ZZ1129,C1128),\"\")","v":""},{"$f":"IF(A1128<=NGrad,IF(D1128=0,0,MATCH(C1128,'Graduate Preferences'!B1129:ZZ1129,0)),\"\")","v":""},"","","",null,null,null,""]
[1126,{"$f":"IF(A1129<=NGrad,'Graduate Preferences'!A1130,\"\")","v":""},{"$f":"IF(A1129<=NGrad,Process!A1129,\"\")","v":""},{"$f":"IF(A1129<=NGrad,COUNTIFS('Graduate Preferences'!B1130:ZZ1130,C1129),\"\")","v":""},{"$f":"IF(A1129<=NGrad,IF(D1129=0,0,MATCH(C1129,'Graduate Preferences'!B1130:ZZ1130,0)),\"\")","v":""},"","","",null,null,null,""]
[1127,{"$f":"IF(A1130<=NGrad,'Graduate Preferences'!A1131,\"\")","v":""},{"$f":"IF(A1130<=NGrad,Process!A1130,\"\")","v":""},{"$f":"IF(A1130<=NGrad,COUNTIFS('Graduate Preferences'!B1131:ZZ1131,C1130),\"\")","v":""},{"$f":"IF(A1130<=NGrad,IF(D1130=0,0,MATCH(C1130,'Graduate Preferences'!B1131:ZZ1131,0)),\"\")","v":""},"","","",null,null,null,""]
[1128,{"$f":"IF(A1131<=NGrad,'Graduate Preferences'!A1132,\"\")","v":""},{"$f":"IF(A1131<=NGrad,Process!A1131,\"\")","v":""},{"$f":"IF(A1131<=NGrad,COUNTIFS('Graduate Preferences'!B1132:ZZ1132,C1131),\"\")","v":""},{"$f":"IF(A1131<=NGrad,IF(D1131=0,0,MATCH(C1131,'Graduate Preferences'!B1132:ZZ1132,0)),\"\")","v":""},"","","",null,null,null,""]
[1129,{"$f":"IF(A1132<=NGrad,'Graduate Preferences'!A1133,\"\")","v":""},{"$f":"IF(A1132<=NGrad,Process!A1132,\"\")","v":""},{"$f":"IF(A1132<=NGrad,COUNTIFS('Graduate Preferences'!B1133:ZZ1133,C1132),\"\")","v":""},{"$f":"IF(A1132<=NGrad,IF(D1132=0,0,MATCH(C1132,'Graduate Preferences'!B1133:ZZ1133,0)),\"\")","v":""},"","","",null,null,null,""]
[1130,{"$f":"IF(A1133<=NGrad,'Graduate Preferences'!A1134,\"\")","v":""},{"$f":"IF(A1133<=NGrad,Process!A1133,\"\")","v":""},{"$f":"IF(A1133<=NGrad,COUNTIFS('Graduate Preferences'!B1134:ZZ1134,C1133),\"\")","v":""},{"$f":"IF(A1133<=NGrad,IF(D1133=0,0,MATCH(C1133,'Graduate Preferences'!B1134:ZZ1134,0)),\"\")","v":""},"","","",null,null,null,""]
[1131,{"$f":"IF(A1134<=NGrad,'Graduate Preferences'!A1135,\"\")","v":""},{"$f":"IF(A1134<=NGrad,Process!A1134,\"\")","v":""},{"$f":"IF(A1134<=NGrad,COUNTIFS('Graduate Preferences'!B1135:ZZ1135,C1134),\"\")","v":""},{"$f":"IF(A1134<=NGrad,IF(D1134=0,0,MATCH(C1134,'Graduate Preferences'!B1135:ZZ1135,0)),\"\")","v":""},"","","",null,null,null,""]
[1132,{"$f":"IF(A1135<=NGrad,'Graduate Preferences'!A1136,\"\")","v":""},{"$f":"IF(A1135<=NGrad,Process!A1135,\"\")","v":""},{"$f":"IF(A1135<=NGrad,COUNTIFS('Graduate Preferences'!B1136:ZZ1136,C1135),\"\")","v":""},{"$f":"IF(A1135<=NGrad,IF(D1135=0,0,MATCH(C1135,'Graduate Preferences'!B1136:ZZ1136,0)),\"\")","v":""},"","","",null,null,null,""]
[1133,{"$f":"IF(A1136<=NGrad,'Graduate Preferences'!A1137,\"\")","v":""},{"$f":"IF(A1136<=NGrad,Process!A1136,\"\")","v":""},{"$f":"IF(A1136<=NGrad,COUNTIFS('Graduate Preferences'!B1137:ZZ1137,C1136),\"\")","v":""},{"$f":"IF(A1136<=NGrad,IF(D1136=0,0,MATCH(C1136,'Graduate Preferences'!B1137:ZZ1137,0)),\"\")","v":""},"","","",null,null,null,""]
[1134,{"$f":"IF(A1137<=NGrad,'Graduate Preferences'!A1138,\"\")","v":""},{"$f":"IF(A1137<=NGrad,Process!A1137,\"\")","v":""},{"$f":"IF(A1137<=NGrad,COUNTIFS('Graduate Preferences'!B1138:ZZ1138,C1137),\"\")","v":""},{"$f":"IF(A1137<=NGrad,IF(D1137=0,0,MATCH(C1137,'Graduate Preferences'!B1138:ZZ1138,0)),\"\")","v":""},"","","",null,null,null,""]
[1135,{"$f":"IF(A1138<=NGrad,'Graduate Preferences'!A1139,\"\")","v":""},{"$f":"IF(A1138<=NGrad,Process!A1138,\"\")","v":""},{"$f":"IF(A1138<=NGrad,COUNTIFS('Graduate Preferences'!B1139:ZZ1139,C1138),\"\")","v":""},{"$f":"IF(A1138<=NGrad,IF(D1138=0,0,MATCH(C1138,'Graduate Preferences'!B1139:ZZ1139,0)),\"\")","v":""},"","","",null,null,null,""]
[1136,{"$f":"IF(A1139<=NGrad,'Graduate Preferences'!A1140,\"\")","v":""},{"$f":"IF(A1139<=NGrad,Process!A1139,\"\")","v":""},{"$f":"IF(A1139<=NGrad,COUNTIFS('Graduate Preferences'!B1140:ZZ1140,C1139),\"\")","v":""},{"$f":"IF(A1139<=NGrad,IF(D1139=0,0,MATCH(C1139,'Graduate Preferences'!B1140:ZZ1140,0)),\"\")","v":""},"","","",null,null,null,""]
[1137,{"$f":"IF(A1140<=NGrad,'Graduate Preferences'!A1141,\"\")","v":""},{"$f":"IF(A1140<=NGrad,Process!A1140,\"\")","v":""},{"$f":"IF(A1140<=NGrad,COUNTIFS('Graduate Preferences'!B1141:ZZ1141,C1140),\"\")","v":""},{"$f":"IF(A1140<=NGrad,IF(D1140=0,0,MATCH(C1140,'Graduate Preferences'!B1141:ZZ1141,0)),\"\")","v":""},"","","",null,null,null,""]
[1138,{"$f":"IF(A1141<=NGrad,'Graduate Preferences'!A1142,\"\")","v":""},{"$f":"IF(A1141<=NGrad,Process!A1141,\"\")","v":""},{"$f":"IF(A1141<=NGrad,COUNTIFS('Graduate Preferences'!B1142:ZZ1142,C1141),\"\")","v":""},{"$f":"IF(A1141<=NGrad,IF(D1141=0,0,MATCH(C1141,'Graduate Preferences'!B1142:ZZ1142,0)),\"\")","v":""},"","","",null,null,null,""]
[1139,{"$f":"IF(A1142<=NGrad,'Graduate Preferences'!A1143,\"\")","v":""},{"$f":"IF(A1142<=NGrad,Process!A1142,\"\")","v":""},{"$f":"IF(A1142<=NGrad,COUNTIFS('Graduate Preferences'!B1143:ZZ1143,C1142),\"\")","v":""},{"$f":"IF(A1142<=NGrad,IF(D1142=0,0,MATCH(C1142,'Graduate Preferences'!B1143:ZZ1143,0)),\"\")","v":""},"","","",null,null,null,""]
[1140,{"$f":"IF(A1143<=NGrad,'Graduate Preferences'!A1144,\"\")","v":""},{"$f":"IF(A1143<=NGrad,Process!A1143,\"\")","v":""},{"$f":"IF(A1143<=NGrad,COUNTIFS('Graduate Preferences'!B1144:ZZ1144,C1143),\"\")","v":""},{"$f":"IF(A1143<=NGrad,IF(D1143=0,0,MATCH(C1143,'Graduate Preferences'!B1144:ZZ1144,0)),\"\")","v":""},"","","",null,null,null,""]
[1141,{"$f":"IF(A1144<=NGrad,'Graduate Preferences'!A1145,\"\")","v":""},{"$f":"IF(A1144<=NGrad,Process!A1144,\"\")","v":""},{"$f":"IF(A1144<=NGrad,COUNTIFS('Graduate Preferences'!B1145:ZZ1145,C1144),\"\")","v":""},{"$f":"IF(A1144<=NGrad,IF(D1144=0,0,MATCH(C1144,'Graduate Preferences'!B1145:ZZ1145,0)),\"\")","v":""},"","","",null,null,null,""]
[1142,{"$f":"IF(A1145<=NGrad,'Graduate Preferences'!A1146,\"\")","v":""},{"$f":"IF(A1145<=NGrad,Process!A1145,\"\")","v":""},{"$f":"IF(A1145<=NGrad,COUNTIFS('Graduate Preferences'!B1146:ZZ1146,C1145),\"\")","v":""},{"$f":"IF(A1145<=NGrad,IF(D1145=0,0,MATCH(C1145,'Graduate Preferences'!B1146:ZZ1146,0)),\"\")","v":""},"","","",null,null,null,""]
[1143,{"$f":"IF(A1146<=NGrad,'Graduate Preferences'!A1147,\"\")","v":""},{"$f":"IF(A1146<=NGrad,Process!A1146,\"\")","v":""},{"$f":"IF(A1146<=NGrad,COUNTIFS('Graduate Preferences'!B1147:ZZ1147,C1146),\"\")","v":""},{"$f":"IF(A1146<=NGrad,IF(D1146=0,0,MATCH(C1146,'Graduate Preferences'!B1147:ZZ1147,0)),\"\")","v":""},"","","",null,null,null,""]
[1144,{"$f":"IF(A1147<=NGrad,'Graduate Preferences'!A1148,\"\")","v":""},{"$f":"IF(A1147<=NGrad,Process!A1147,\"\")","v":""},{"$f":"IF(A1147<=NGrad,COUNTIFS('Graduate Preferences'!B1148:ZZ1148,C1147),\"\")","v":""},{"$f":"IF(A1147<=NGrad,IF(D1147=0,0,MATCH(C1147,'Graduate Preferences'!B1148:ZZ1148,0)),\"\")","v":""},"","","",null,null,null,""]
[1145,{"$f":"IF(A1148<=NGrad,'Graduate Preferences'!A1149,\"\")","v":""},{"$f":"IF(A1148<=NGrad,Process!A1148,\"\")","v":""},{"$f":"IF(A1148<=NGrad,COUNTIFS('Graduate Preferences'!B1149:ZZ1149,C1148),\"\")","v":""},{"$f":"IF(A1148<=NGrad,IF(D1148=0,0,MATCH(C1148,'Graduate Preferences'!B1149:ZZ1149,0)),\"\")","v":""},"","","",null,null,null,""]
[1146,{"$f":"IF(A1149<=NGrad,'Graduate Preferences'!A1150,\"\")","v":""},{"$f":"IF(A1149<=NGrad,Process!A1149,\"\")","v":""},{"$f":"IF(A1149<=NGrad,COUNTIFS('Graduate Preferences'!B1150:ZZ1150,C1149),\"\")","v":""},{"$f":"IF(A1149<=NGrad,IF(D1149=0,0,MATCH(C1149,'Graduate Preferences'!B1150:ZZ1150,0)),\"\")","v":""},"","","",null,null,null,""]
[1147,{"$f":"IF(A1150<=NGrad,'Graduate Preferences'!A1151,\"\")","v":""},{"$f":"IF(A1150<=NGrad,Process!A1150,\"\")","v":""},{"$f":"IF(A1150<=NGrad,COUNTIFS('Graduate Preferences'!B1151:ZZ1151,C1150),\"\")","v":""},{"$f":"IF(A1150<=NGrad,IF(D1150=0,0,MATCH(C1150,'Graduate Preferences'!B1151:ZZ1151,0)),\"\")","v":""},"","","",null,null,null,""]
[1148,{"$f":"IF(A1151<=NGrad,'Graduate Preferences'!A1152,\"\")","v":""},{"$f":"IF(A1151<=NGrad,Process!A1151,\"\")","v":""},{"$f":"IF(A1151<=NGrad,COUNTIFS('Graduate Preferences'!B1152:ZZ1152,C1151),\"\")","v":""},{"$f":"IF(A1151<=NGrad,IF(D1151=0,0,MATCH(C1151,'Graduate Preferences'!B1152:ZZ1152,0)),\"\")","v":""},"","","",null,null,null,""]
[1149,{"$f":"IF(A1152<=NGrad,'Graduate Preferences'!A1153,\"\")","v":""},{"$f":"IF(A1152<=NGrad,Process!A1152,\"\")","v":""},{"$f":"IF(A1152<=NGrad,COUNTIFS('Graduate Preferences'!B1153:ZZ1153,C1152),\"\")","v":""},{"$f":"IF(A1152<=NGrad,IF(D1152=0,0,MATCH(C1152,'Graduate Preferences'!B1153:ZZ1153,0)),\"\")","v":""},"","","",null,null,null,""]
[1150,{"$f":"IF(A1153<=NGrad,'Graduate Preferences'!A1154,\"\")","v":""},{"$f":"IF(A1153<=NGrad,Process!A1153,\"\")","v":""},{"$f":"IF(A1153<=NGrad,COUNTIFS('Graduate Preferences'!B1154:ZZ1154,C1153),\"\")","v":""},{"$f":"IF(A1153<=NGrad,IF(D1153=0,0,MATCH(C1153,'Graduate Preferences'!B1154:ZZ1154,0)),\"\")","v":""},"","","",null,null,null,""]
[1151,{"$f":"IF(A1154<=NGrad,'Graduate Preferences'!A1155,\"\")","v":""},{"$f":"IF(A1154<=NGrad,Process!A1154,\"\")","v":""},{"$f":"IF(A1154<=NGrad,COUNTIFS('Graduate Preferences'!B1155:ZZ1155,C1154),\"\")","v":""},{"$f":"IF(A1154<=NGrad,IF(D1154=0,0,MATCH(C1154,'Graduate Preferences'!B1155:ZZ1155,0)),\"\")","v":""},"","","",null,null,null,""]
[1152,{"$f":"IF(A1155<=NGrad,'Graduate Preferences'!A1156,\"\")","v":""},{"$f":"IF(A1155<=NGrad,Process!A1155,\"\")","v":""},{"$f":"IF(A1155<=NGrad,COUNTIFS('Graduate Preferences'!B1156:ZZ1156,C1155),\"\")","v":""},{"$f":"IF(A1155<=NGrad,IF(D1155=0,0,MATCH(C1155,'Graduate Preferences'!B1156:ZZ1156,0)),\"\")","v":""},"","","",null,null,null,""]
[1153,{"$f":"IF(A1156<=NGrad,'Graduate Preferences'!A1157,\"\")","v":""},{"$f":"IF(A1156<=NGrad,Process!A1156,\"\")","v":""},{"$f":"IF(A1156<=NGrad,COUNTIFS('Graduate Preferences'!B1157:ZZ1157,C1156),\"\")","v":""},{"$f":"IF(A1156<=NGrad,IF(D1156=0,0,MATCH(C1156,'Graduate Preferences'!B1157:ZZ1157,0)),\"\")","v":""},"","","",null,null,null,""]
[1154,{"$f":"IF(A1157<=NGrad,'Graduate Preferences'!A1158,\"\")","v":""},{"$f":"IF(A1157<=NGrad,Process!A1157,\"\")","v":""},{"$f":"IF(A1157<=NGrad,COUNTIFS('Graduate Preferences'!B1158:ZZ1158,C1157),\"\")","v":""},{"$f":"IF(A1157<=NGrad,IF(D1157=0,0,MATCH(C1157,'Graduate Preferences'!B1158:ZZ1158,0)),\"\")","v":""},"",{"$f":"IF(F1157=\"\",\"\",RANK(F1157,F$4:F$1000))","v":""},"",null,null,null,{"$f":"IF(MAX(H$4:H$1000)>=A1157,MATCH(A1157,H$4:H$1000,0),\"\")","v":""}]
[1155,{"$f":"IF(A1158<=NGrad,'Graduate Preferences'!A1159,\"\")","v":""},{"$f":"IF(A1158<=NGrad,Process!A1158,\"\")","v":""},{"$f":"IF(A1158<=NGrad,COUNTIFS('Graduate Preferences'!B1159:ZZ1159,C1158),\"\")","v":""},{"$f":"IF(A1158<=NGrad,IF(D1158=0,0,MATCH(C1158,'Graduate Preferences'!B1159:ZZ1159,0)),\"\")","v":""},{"$f":"IF(AND(J1158<>\"-\",J1158>0,I1158=F$2),J1158,\"\")","v":""},"",{"$f":"IF(F1158=\"\",\"\",MAX(G$4:G$1000)-G1158+1)","v":""},null,null,null,""]
[1156,{"$f":"IF(A1159<=NGrad,'Graduate Preferences'!A1160,\"\")","v":""},{"$f":"IF(A1159<=NGrad,Process!A1159,\"\")","v":""},{"$f":"IF(A1159<=NGrad,COUNTIFS('Graduate Preferences'!B1160:ZZ1160,C1159),\"\")","v":""},{"$f":"IF(A1159<=NGrad,IF(D1159=0,0,MATCH(C1159,'Graduate Preferences'!B1160:ZZ1160,0)),\"\")","v":""},"","","",null,null,null,""]
[1157,{"$f":"IF(A1160<=NGrad,'Graduate Preferences'!A1161,\"\")","v":""},{"$f":"IF(A1160<=NGrad,Process!A1160,\"\")","v":""},{"$f":"IF(A1160<=NGrad,COUNTIFS('Graduate Preferences'!B1161:ZZ1161,C1160),\"\")","v":""},{"$f":"IF(A1160<=NGrad,IF(D1160=0,0,MATCH(C1160,'Graduate Preferences'!B1161:ZZ1161,0)),\"\")","v":""},"","","",null,null,null,""]
[1158,{"$f":"IF(A1161<=NGrad,'Graduate Preferences'!A1162,\"\")","v":""},{"$f":"IF(A1161<=NGrad,Process!A1161,\"\")","v":""},{"$f":"IF(A1161<=NGrad,COUNTIFS('Graduate Preferences'!B1162:ZZ1162,C1161),\"\")","v":""},{"$f":"IF(A1161<=NGrad,IF(D1161=0,0,MATCH(C1161,'Graduate Preferences'!B1162:ZZ1162,0)),\"\")","v":""},"","","",null,null,null,""]
[1159,{"$f":"IF(A1162<=NGrad,'Graduate Preferences'!A1163,\"\")","v":""},{"$f":"IF(A1162<=NGrad,Process!A1162,\"\")","v":""},{"$f":"IF(A1162<=NGrad,COUNTIFS('Graduate Preferences'!B1163:ZZ1163,C1162),\"\")","v":""},{"$f":"IF(A1162<=NGrad,IF(D1162=0,0,MATCH(C1162,'Graduate Preferences'!B1163:ZZ1163,0)),\"\")","v":""},"","","",null,null,null,""]
[1160,{"$f":"IF(A1163<=NGrad,'Graduate Preferences'!A1164,\"\")","v":""},{"$f":"IF(A1163<=NGrad,Process!A1163,\"\")","v":""},{"$f":"IF(A1163<=NGrad,COUNTIFS('Graduate Preferences'!B1164:ZZ1164,C1163),\"\")","v":""},{"$f":"IF(A1163<=NGrad,IF(D1163=0,0,MATCH(C1163,'Graduate Preferences'!B1164:ZZ1164,0)),\"\")","v":""},"","","",null,null,null,""]
[1161,{"$f":"IF(A1164<=NGrad,'Graduate Preferences'!A1165,\"\")","v":""},{"$f":"IF(A1164<=NGrad,Process!A1164,\"\")","v":""},{"$f":"IF(A1164<=NGrad,COUNTIFS('Graduate Preferences'!B1165:ZZ1165,C1164),\"\")","v":""},{"$f":"IF(A1164<=NGrad,IF(D1164=0,0,MATCH(C1164,'Graduate Preferences'!B1165:ZZ1165,0)),\"\")","v":""},"","","",null,null,null,""]
[1162,{"$f":"IF(A1165<=NGrad,'Graduate Preferences'!A1166,\"\")","v":""},{"$f":"IF(A1165<=NGrad,Process!A1165,\"\")","v":""},{"$f":"IF(A1165<=NGrad,COUNTIFS('Graduate Preferences'!B1166:ZZ1166,C1165),\"\")","v":""},{"$f":"IF(A1165<=NGrad,IF(D1165=0,0,MATCH(C1165,'Graduate Preferences'!B1166:ZZ1166,0)),\"\")","v":""},"","","",null,null,null,""]
[1163,{"$f":"IF(A1166<=NGrad,'Graduate Preferences'!A1167,\"\")","v":""},{"$f":"IF(A1166<=NGrad,Process!A1166,\"\")","v":""},{"$f":"IF(A1166<=NGrad,COUNTIFS('Graduate Preferences'!B1167:ZZ1167,C1166),\"\")","v":""},{"$f":"IF(A1166<=NGrad,IF(D1166=0,0,MATCH(C1166,'Graduate Preferences'!B1167:ZZ1167,0)),\"\")","v":""},"","","",null,null,null,""]
[1164,{"$f":"IF(A1167<=NGrad,'Graduate Preferences'!A1168,\"\")","v":""},{"$f":"IF(A1167<=NGrad,Process!A1167,\"\")","v":""},{"$f":"IF(A1167<=NGrad,COUNTIFS('Graduate Preferences'!B1168:ZZ1168,C1167),\"\")","v":""},{"$f":"IF(A1167<=NGrad,IF(D1167=0,0,MATCH(C1167,'Graduate Preferences'!B1168:ZZ1168,0)),\"\")","v":""},"","","",null,null,null,""]
[1165,{"$f":"IF(A1168<=NGrad,'Graduate Preferences'!A1169,\"\")","v":""},{"$f":"IF(A1168<=NGrad,Process!A1168,\"\")","v":""},{"$f":"IF(A1168<=NGrad,COUNTIFS('Graduate Preferences'!B1169:ZZ1169,C1168),\"\")","v":""},{"$f":"IF(A1168<=NGrad,IF(D1168=0,0,MATCH(C1168,'Graduate Preferences'!B1169:ZZ1169,0)),\"\")","v":""},"","","",null,null,null,""]
[1166,{"$f":"IF(A1169<=NGrad,'Graduate Preferences'!A1170,\"\")","v":""},{"$f":"IF(A1169<=NGrad,Process!A1169,\"\")","v":""},{"$f":"IF(A1169<=NGrad,COUNTIFS('Graduate Preferences'!B1170:ZZ1170,C1169),\"\")","v":""},{"$f":"IF(A1169<=NGrad,IF(D1169=0,0,MATCH(C1169,'Graduate Preferences'!B1170:ZZ1170,0)),\"\")","v":""},"","","",null,null,null,""]
[1167,{"$f":"IF(A1170<=NGrad,'Graduate Preferences'!A1171,\"\")","v":""},{"$f":"IF(A1170<=NGrad,Process!A1170,\"\")","v":""},{"$f":"IF(A1170<=NGrad,COUNTIFS('Graduate Preferences'!B1171:ZZ1171,C1170),\"\")","v":""},{"$f":"IF(A1170<=NGrad,IF(D1170=0,0,MATCH(C1170,'Graduate Preferences'!B1171:ZZ1171,0)),\"\")","v":""},"","","",null,null,null,""]
[1168,{"$f":"IF(A1171<=NGrad,'Graduate Preferences'!A1172,\"\")","v":""},{"$f":"IF(A1171<=NGrad,Process!A1171,\"\")","v":""},{"$f":"IF(A1171<=NGrad,COUNTIFS('Graduate Preferences'!B1172:ZZ1172,C1171),\"\")","v":""},{"$f":"IF(A1171<=NGrad,IF(D1171=0,0,MATCH(C1171,'Graduate Preferences'!B1172:ZZ1172,0)),\"\")","v":""},"","","",null,null,null,""]
[1169,{"$f":"IF(A1172<=NGrad,'Graduate Preferences'!A1173,\"\")","v":""},{"$f":"IF(A1172<=NGrad,Process!A1172,\"\")","v":""},{"$f":"IF(A1172<=NGrad,COUNTIFS('Graduate Preferences'!B1173:ZZ1173,C1172),\"\")","v":""},{"$f":"IF(A1172<=NGrad,IF(D1172=0,0,MATCH(C1172,'Graduate Preferences'!B1173:ZZ1173,0)),\"\")","v":""},"","","",null,null,null,""]
[1170,{"$f":"IF(A1173<=NGrad,'Graduate Preferences'!A1174,\"\")","v":""},{"$f":"IF(A1173<=NGrad,Process!A1173,\"\")","v":""},{"$f":"IF(A1173<=NGrad,COUNTIFS('Graduate Preferences'!B1174:ZZ1174,C1173),\"\")","v":""},{"$f":"IF(A1173<=NGrad,IF(D1173=0,0,MATCH(C1173,'Graduate Preferences'!B1174:ZZ1174,0)),\"\")","v":""},"","","",null,null,null,""]
[1171,{"$f":"IF(A1174<=NGrad,'Graduate Preferences'!A1175,\"\")","v":""},{"$f":"IF(A1174<=NGrad,Process!A1174,\"\")","v":""},{"$f":"IF(A1174<=NGrad,COUNTIFS('Graduate Preferences'!B1175:ZZ1175,C1174),\"\")","v":""},{"$f":"IF(A1174<=NGrad,IF(D1174=0,0,MATCH(C1174,'Graduate Preferences'!B1175:ZZ1175,0)),\"\")","v":""},"","","",null,null,null,""]
[1172,{"$f":"IF(A1175<=NGrad,'Graduate Preferences'!A1176,\"\")","v":""},{"$f":"IF(A1175<=NGrad,Process!A1175,\"\")","v":""},{"$f":"IF(A1175<=NGrad,COUNTIFS('Graduate Preferences'!B1176:ZZ1176,C1175),\"\")","v":""},{"$f":"IF(A1175<=NGrad,IF(D1175=0,0,MATCH(C1175,'Graduate Preferences'!B1176:ZZ1176,0)),\"\")","v":""},"","","",null,null,null,""]
[1173,{"$f":"IF(A1176<=NGrad,'Graduate Preferences'!A1177,\"\")","v":""},{"$f":"IF(A1176<=NGrad,Process!A1176,\"\")","v":""},{"$f":"IF(A1176<=NGrad,COUNTIFS('Graduate Preferences'!B1177:ZZ1177,C1176),\"\")","v":""},{"$f":"IF(A1176<=NGrad,IF(D1176=0,0,MATCH(C1176,'Graduate Preferences'!B1177:ZZ1177,0)),\"\")","v":""},"","","",null,null,null,""]
[1174,{"$f":"IF(A1177<=NGrad,'Graduate Preferences'!A1178,\"\")","v":""},{"$f":"IF(A1177<=NGrad,Process!A1177,\"\")","v":""},{"$f":"IF(A1177<=NGrad,COUNTIFS('Graduate Preferences'!B1178:ZZ1178,C1177),\"\")","v":""},{"$f":"IF(A1177<=NGrad,IF(D1177=0,0,MATCH(C1177,'Graduate Preferences'!B1178:ZZ1178,0)),\"\")","v":""},"","",""]
[1175,{"$f":"IF(A1178<=NGrad,'Graduate Preferences'!A1179,\"\")","v":""},{"$f":"IF(A1178<=NGrad,Process!A1178,\"\")","v":""},{"$f":"IF(A1178<=NGrad,COUNTIFS('Graduate Preferences'!B1179:ZZ1179,C1178),\"\")","v":""},{"$f":"IF(A1178<=NGrad,IF(D1178=0,0,MATCH(C1178,'Graduate Preferences'!B1179:ZZ1179,0)),\"\")","v":""},"","",""]
[1176,{"$f":"IF(A1179<=NGrad,'Graduate Preferences'!A1180,\"\")","v":""},{"$f":"IF(A1179<=NGrad,Process!A1179,\"\")","v":""},{"$f":"IF(A1179<=NGrad,COUNTIFS('Graduate Preferences'!B1180:ZZ1180,C1179),\"\")","v":""},{"$f":"IF(A1179<=NGrad,IF(D1179=0,0,MATCH(C1179,'Graduate Preferences'!B1180:ZZ1180,0)),\"\")","v":""},"","",""]
[1177,{"$f":"IF(A1180<=NGrad,'Graduate Preferences'!A1181,\"\")","v":""},{"$f":"IF(A1180<=NGrad,Process!A1180,\"\")","v":""},{"$f":"IF(A1180<=NGrad,COUNTIFS('Graduate Preferences'!B1181:ZZ1181,C1180),\"\")","v":""},{"$f":"IF(A1180<=NGrad,IF(D1180=0,0,MATCH(C1180,'Graduate Preferences'!B1181:ZZ1181,0)),\"\")","v":""},"","",""]
[1178,{"$f":"IF(A1181<=NGrad,'Graduate Preferences'!A1182,\"\")","v":""},{"$f":"IF(A1181<=NGrad,Process!A1181,\"\")","v":""},{"$f":"IF(A1181<=NGrad,COUNTIFS('Graduate Preferences'!B1182:ZZ1182,C1181),\"\")","v":""},{"$f":"IF(A1181<=NGrad,IF(D1181=0,0,MATCH(C1181,'Graduate Preferences'!B1182:ZZ1182,0)),\"\")","v":""},"","",""]
[1179,{"$f":"IF(A1182<=NGrad,'Graduate Preferences'!A1183,\"\")","v":""},{"$f":"IF(A1182<=NGrad,Process!A1182,\"\")","v":""},{"$f":"IF(A1182<=NGrad,COUNTIFS('Graduate Preferences'!B1183:ZZ1183,C1182),\"\")","v":""},{"$f":"IF(A1182<=NGrad,IF(D1182=0,0,MATCH(C1182,'Graduate Preferences'!B1183:ZZ1183,0)),\"\")","v":""},"","",""]